program: Gaussian 09
title: 000265757
version: EM64L-G09RevD.01
frameworkgroup: C1[X(C13H19N3O2)]
method: RPBEPBE
basis: SDD
operation: Freq
keyword: #p
keyword: freq=noraman
keyword: PBEPBE/SDD
title: #p freq=noraman PBEPBE/SDD
converged: YES YES NO NO
title: Mulliken charges:
elementType: O O N N N C C C C C C C C C C C C C H H H H H H H H H H H H H H H H H H H
charge: -0.284196 -0.248943 -0.059183 -0.013684 -0.168238 -0.347839 -0.361808 -0.334747 -0.692191 -0.599358 0.106136 0.184133 -0.366501 -0.325475 -0.210254 -0.248547 0.170166 -0.501687 0.234615 0.185466 0.255241 0.202943 0.190833 0.205940 0.215585 0.217684 0.209583 0.225415 0.258309 0.232388 0.244308 0.260829 0.228344 0.229847 0.239081 0.236223 0.229582
chargesum: 0.00000
title: Mulliken charges with hydrogens summed into heavy atoms:
elementType: O O N N N C C C C C C C C C C C C C
charge: -0.284196 -0.248943 -0.059183 -0.013684 -0.168238 0.072241 0.096376 0.062026 -0.049339 0.116755 0.106136 0.184133 -0.122193 -0.064646 0.018090 -0.018700 0.170166 0.203199
polarizability: 2.43908337e+02 -2.92974695e+01 2.18094305e+02 2.70818407e+00 -1.72181918e+00 1.04483323e+02
1716.lowfreq: -14.4332 -2.9701 -0.0007 -0.0005 -0.0003 9.7176 17.6966 26.6875 44.3228
frequency: 14.9319 26.2237 44.3027 51.1086 68.2117 88.5417 96.7197 104.0436 107.5229 119.9701 139.8491 145.4495 201.2697 207.8022 222.7429 235.9144 272.9726 300.3878 314.5884 332.6591 362.0035 390.7749 423.9623 451.3749 471.7330 489.0646 552.7626 579.9303 636.0702 650.9901 684.9201 729.8238 755.7433 765.4308 773.3949 780.8811 825.5401 876.1297 890.4500 900.4699 920.9100 930.6164 961.9151 987.2379 1016.2143 1033.0041 1039.2992 1048.9964 1071.8387 1096.6290 1106.7622 1112.0380 1117.8500 1120.4130 1144.0820 1169.2824 1191.9497 1215.5546 1225.6101 1263.0794 1265.4748 1270.0255 1285.6532 1290.1815 1336.5475 1345.7785 1354.0208 1373.0187 1385.6654 1386.9417 1419.7693 1425.6340 1428.0254 1445.3373 1450.5737 1463.0476 1465.2272 1465.4151 1468.2523 1474.6499 1475.9818 1485.8211 1487.2584 1562.5465 1601.1219 1620.9828 2965.2269 2970.2238 2974.0603 2977.3195 2995.2855 2998.6610 3012.5360 3044.8135 3044.9174 3067.8945 3073.4887 3075.5617 3097.1998 3122.4136 3131.4002 3142.0353 3148.0036 3161.8598 3173.8454
redmass: 3.6665 3.9745 4.6093 1.8675 2.8545 3.9402 1.8759 2.2625 2.0282 2.1474 1.5840 2.4669 3.6318 3.0192 1.3056 2.5725 5.6424 4.1959 5.2016 3.9973 3.9533 4.3300 3.9905 3.5000 5.0627 4.7156 3.9897 4.9273 5.9940 5.8452 4.9094 1.0902 5.6856 2.7041 1.6671 1.2442 5.0488 1.6859 2.3940 1.8960 5.1129 1.5334 1.3979 1.3269 3.9318 2.7923 4.7605 1.8576 2.5716 1.7568 1.8750 1.2877 1.7149 1.4781 1.4593 1.0707 2.4600 2.1394 2.8535 1.3212 1.5218 1.8949 2.0649 1.1085 1.6740 2.8966 1.5498 2.2745 2.4789 1.6825 1.2455 1.1454 2.0505 1.2416 1.0508 1.8843 1.1917 1.0867 1.0589 1.0587 1.0480 1.0881 1.1156 6.5628 6.8254 9.4890 1.0588 1.0364 1.0382 1.0611 1.0599 1.0297 1.0964 1.1002 1.1000 1.1028 1.1008 1.1018 1.1040 1.0976 1.0856 1.1043 1.0900 1.0951 1.0992
irintensity: 0.2153 0.1182 1.3213 0.6103 3.5687 0.9816 0.8338 0.5642 1.0823 1.9076 1.2126 0.9224 1.4990 1.3166 1.1510 3.6327 3.0684 11.1768 3.4485 3.8439 0.9939 2.0379 2.9832 4.9409 6.4026 7.7873 3.7608 5.3631 1.9765 4.6750 28.5595 15.6101 13.2355 43.5549 37.6284 1.6643 17.1534 0.8786 2.7285 6.1337 5.2988 3.5765 3.2096 0.6689 7.9912 61.7300 244.7981 69.7909 0.4867 42.7503 13.4443 0.2189 11.9988 5.1382 48.5632 5.9584 6.0736 57.3258 179.0685 8.2578 6.3602 0.3154 15.2543 1.9880 89.0684 162.3181 4.5890 75.3318 68.6727 58.0384 21.9195 18.9584 35.0876 51.8786 11.8419 62.7930 16.6869 4.2544 10.6551 8.5966 11.5157 10.2422 32.0381 24.3534 16.9918 170.4496 25.6133 74.1427 27.3049 52.2730 57.8051 46.1607 10.0091 23.0672 13.8000 5.2317 57.4551 81.9241 28.5638 9.1174 3.3775 19.4018 12.2781 17.8782 22.3708
temp: 298.150 k
press: 1.00000 atm
elementType: 8 8 7 7 7 6 6 6 6 6 6 6 6 6 6 6 6 6 1 1 1 1 1 1 1 1 1 1 1 1 1 1 1 1 1 1 1
symmnumber: 1
zpe: 795933.2 jmol-1
zpe.correction: 0.303155 hartree
zpe.thermalcorrener: 0.322898 hartree
zpe.thermalcorrenthalpy: 0.323842 hartree
zpe.thermalcorrgfe: 0.252208 hartree
zpe.sumelectzpe: -820.059793 hartree
zpe.sumelectthermal: -820.040050 hartree
zpe.sumelectthermalent: -820.039106 hartree
zpe.sumelectthermalfe: -820.110740 hartree
dipole: 1.6438 -1.6102 -1.1209
dipole: 2.5595
quadrupole: -90.1623 -91.1228 -112.7691
quadrupole: -1.8139 -0.7885 3.0226
quadrupole: 7.8558 6.8953 -14.7511 -1.8139 -0.7885 3.0226
hfenergy: -820.3629481 hartree
pointgroup: C01 [X(C13H19N3O2)]
dipole: 0.6898009 0.551978 0.4832405 debye
polarizability: 246.2578403|28.5501508|214.5868249|-4.2831572|9.8240042|105.6412997 unknown
InChI: InChI=1S/C13H19N3O2/c1-4-5-10-16(2)15-14-12-9-7-6-8-11(12)13(17)18-3/h6-9H,4-5,10H2,1-3H3
charge 0 multiplicity 1
37 atoms
O  -3.259269 1.543362 0.506652
O  -1.475095 1.789463 -0.966003
N  1.710642 1.323756 0.469404
N  0.565385 0.614987 0.611665
N  0.51244 -0.480848 -0.123537
C  3.795506 -0.055323 0.096492
C  2.779432 0.957035 -0.485644
C  4.907803 -0.400841 -0.920008
C  5.935262 -1.404392 -0.353877
C  1.854213 2.487054 1.347351
C  -0.760898 -1.11031 -0.095439
C  -2.023787 -0.429795 -0.032071
C  -0.74577 -2.530462 -0.154894
C  -3.21466 -1.199977 0.0600
C  -1.937613 -3.274356 -0.085586
C  -3.181443 -2.608067 0.040934
C  -2.156095 1.047306 -0.21699
C  -3.543391 2.980692 0.305145
H  3.251208 -0.974184 0.383877
H  4.252782 0.359115 1.018008
H  2.287316 0.51908 -1.373029
H  3.291646 1.891721 -0.783488
H  5.429286 0.528548 -1.229227
H  4.445606 -0.820399 -1.836155
H  5.444561 -2.353429 -0.068021
H  6.720055 -1.639319 -1.095968
H  6.432141 -0.998709 0.547498
H  2.735414 2.382868 2.009245
H  0.945654 2.561628 1.9633
H  1.96765 3.412676 0.752428
H  0.228048 -3.024943 -0.231685
H  -4.169857 -0.670869 0.124984
H  -1.899565 -4.368807 -0.121808
H  -4.113591 -3.179136 0.103416
H  -3.766604 3.186294 -0.755865
H  -2.675869 3.59018 0.610903
H  -4.415647 3.186403 0.94199
