program: Gaussian 09
title: 000265720
version: EM64L-G09RevD.01
frameworkgroup: C1[X(C16H14O3)]
method: RPBEPBE
basis: SDD
operation: Freq
keyword: #pfreq=noraman
keyword: PBEPBE/SDD
title: #p freq=noraman PBEPBE/SDD
converged: YES YES NO NO
title: Mulliken charges:
elementType: O O O C C C C C C C C C C C C C C C C H H H H H H H H H H H H H H
charge: -0.262557 -0.471298 -0.266099 0.141864 0.264645 -0.324128 0.363475 0.102378 -0.553281 -0.390329 0.466447 -0.337041 -0.274341 -0.375827 -0.388317 -0.240181 -0.239740 -0.236789 -0.534558 0.286015 0.239715 0.245766 0.291247 0.266188 0.234834 0.237229 0.226288 0.229135 0.230425 0.366396 0.227519 0.227474 0.247448
chargesum: 0.00000
title: Mulliken charges with hydrogens summed into heavy atoms:
elementType: O O O C C C C C C C C C C C C C C C C
charge: -0.262557 -0.104902 -0.266099 0.141864 0.264645 -0.038113 0.363475 0.102378 -0.313566 -0.144564 0.466447 -0.045794 -0.008154 -0.140993 -0.151088 -0.013894 -0.010605 -0.006363 0.167884
polarizability: 4.11436543e+02 6.51419120e+00 1.86605109e+02 5.62741819e-01 -3.43456927e-01 7.59251475e+01
1716.lowfreq: -3.6462 -0.0011 -0.0008 0.0004 2.4180 5.8788 15.2705 25.8069 47.8752
frequency: 14.6246 25.7230 47.8519 74.7662 89.0775 104.6045 138.1706 155.6877 195.6812 215.7636 227.0047 234.3363 274.2838 300.3908 309.6929 361.5123 371.5810 381.8507 403.5796 454.0037 473.3589 494.5204 541.1039 554.9716 586.9233 596.2501 615.7106 616.9873 663.8192 695.1366 711.2019 739.2763 771.8967 777.9389 818.7226 837.8150 849.3402 873.1799 910.9048 911.9702 934.7418 980.9176 987.8791 991.8695 996.4624 1002.2271 1024.1971 1026.6951 1039.7824 1083.2990 1094.6399 1113.1731 1144.5773 1158.1486 1173.0850 1175.9124 1190.2389 1218.8895 1226.3907 1261.0602 1282.3919 1299.4370 1331.6714 1339.4670 1385.7786 1386.7139 1427.0437 1437.3554 1440.5739 1467.8418 1472.3357 1484.4941 1493.0428 1509.8658 1579.0544 1580.6893 1609.3304 1619.7581 1637.5079 2970.3206 3062.5438 3097.5972 3122.8344 3128.2301 3131.6758 3134.0440 3140.8890 3148.0070 3151.9433 3165.9747 3175.0759 3187.3480 3571.1854
redmass: 5.3057 4.0490 5.5736 3.9844 5.9546 3.9912 2.9927 4.5494 5.8308 1.3870 2.7259 4.6561 3.0297 6.8327 3.7126 5.9823 5.7238 1.2247 2.7693 2.9792 5.0946 2.8677 6.8404 7.0665 4.5548 5.3919 6.3888 6.0391 3.0870 1.7179 6.9059 2.2888 6.5153 1.9893 1.5982 1.7986 1.2697 4.3791 5.8006 1.6804 1.6660 1.3903 6.1832 1.3357 1.3208 4.2211 2.3517 1.1599 3.9900 1.6027 2.1785 1.2571 1.4461 1.2187 1.0701 1.6480 1.1232 2.4549 1.7541 2.5977 1.4502 1.9372 1.3401 1.8055 5.8047 6.6650 4.7486 1.2295 2.1913 1.0495 1.0666 2.3231 3.8950 4.6691 6.7558 5.9184 5.9133 6.3808 5.5874 1.0324 1.1044 1.0891 1.0857 1.0873 1.1003 1.0917 1.0917 1.0886 1.0963 1.1016 1.0944 1.0911 1.0657
irintensity: 0.9771 0.6732 0.6789 0.1573 0.0619 6.8064 1.0782 4.0256 0.9673 0.1524 0.0066 5.1109 0.6864 0.8638 14.7027 2.3507 0.4281 115.7511 0.1875 6.9457 28.3634 18.0871 12.1539 45.2665 17.2402 17.8024 0.6716 0.9205 13.5901 37.8421 5.5168 15.2052 13.1228 62.3186 4.2386 73.4771 0.0089 2.4836 3.0281 7.2252 0.6481 0.1293 4.6492 0.8756 2.2150 88.4115 3.9506 51.9947 10.1518 9.9423 292.9889 0.1851 9.0167 133.4206 1.6501 26.2670 8.3399 154.1186 148.5663 201.1736 29.9978 16.6354 15.1712 294.8224 22.3848 33.9964 19.8307 6.8243 39.7838 14.3764 57.7241 48.3882 83.1695 85.7454 41.5641 64.7640 23.1965 771.0388 45.1972 80.8965 41.8781 1.9875 4.9332 0.1443 24.7131 4.7383 13.4061 1.1646 38.9771 34.3548 18.2806 26.7326 35.0617
temp: 298.150 k
press: 1.00000 atm
elementType: 8 8 8 6 6 6 6 6 6 6 6 6 6 6 6 6 6 6 6 1 1 1 1 1 1 1 1 1 1 1 1 1 1
symmnumber: 1
zpe: 671209.2 jmol-1
zpe.correction: 0.255650 hartree
zpe.thermalcorrener: 0.272825 hartree
zpe.thermalcorrenthalpy: 0.273769 hartree
zpe.thermalcorrgfe: 0.208588 hartree
zpe.sumelectzpe: -842.404364 hartree
zpe.sumelectthermal: -842.387189 hartree
zpe.sumelectthermalent: -842.386245 hartree
zpe.sumelectthermalfe: -842.451426 hartree
dipole: 2.3971 -3.2643 0.0136
dipole: 4.0499
quadrupole: -68.0862 -103.9177 -117.4343
quadrupole: 4.5568 0.2369 0.0217
quadrupole: 28.3932 -7.4383 -20.9549 4.5568 0.2369 0.0217
hfenergy: -842.6600141 hartree
pointgroup: C01 [X(C16H14O3)]
dipole: 0.9723835 -0.7020146 -1.0490381 debye
polarizability: 408.9955968|-15.9412575|105.0568781|23.4397708|47.2113966|159.9143237 unknown
InChI: InChI=1S/C16H14O3/c1-19-13-8-9-14(16(18)11-13)15(17)10-7-12-5-3-2-4-6-12/h2-11,18H,1H3
charge 0 multiplicity 1
33 atoms
O  5.576464 -1.013695 -0.407331
O  0.893903 -1.162319 -1.43103
O  0.091987 1.005437 2.235537
C  1.563368 -0.046214 0.656827
C  1.905875 -0.753502 -0.540341
C  2.648697 0.329941 1.496617
C  4.291991 -0.659408 0.011416
C  0.191704 0.35226 1.137913
C  3.247666 -1.05319 -0.854916
C  3.99165 0.04391 1.20768
C  -3.55166 0.099639 0.152318
C  -1.020643 -0.006126 0.359554
C  -2.26276 0.372527 0.800288
C  -3.674031 -0.63299 -1.066376
C  -4.742434 0.588448 0.765326
C  -4.937024 -0.863714 -1.643441
C  -6.00796 0.357843 0.187299
C  -6.110948 -0.369903 -1.020834
C  6.703465 -0.634583 0.453812
H  2.377547 0.871653 2.409191
H  3.509679 -1.594647 -1.772013
H  4.778028 0.361507 1.897227
H  -0.875413 -0.571653 -0.562155
H  -2.29353 0.94343 1.7404
H  -2.77582 -1.020636 -1.55905
H  -4.663256 1.153225 1.702364
H  -5.013688 -1.428357 -2.579499
H  -6.910279 0.742794 0.67499
H  -7.092049 -0.551642 -1.473584
H  1.289466 -1.628529 -2.209257
H  6.620886 -1.108279 1.450321
H  6.768908 0.46429 0.56555
H  7.597009 -1.010418 -0.0650
