program: Gaussian 09
title: 000265742
version: EM64L-G09RevD.01
frameworkgroup: C1[X(C18H10Cl4N2O2)]
method: RPBEPBE
basis: SDD
operation: Freq
keyword: #p
keyword: freq=noraman
keyword: PBEPBE/SDD
title: #p freq=noraman PBEPBE/SDD
converged: YES YES NO NO
title: Mulliken charges:
elementType: Cl Cl Cl Cl O O N N C C C C C C C C C C C C C C C C C C H H H H H H H H H H
charge: 0.038240 0.038243 -0.033078 -0.033082 -0.219526 -0.219531 -0.456896 -0.456881 0.493513 0.493375 -0.541686 -0.541639 0.120898 0.121003 0.561572 0.561582 -0.365151 -0.365152 -0.319944 -0.319939 -0.207866 -0.207867 -0.223036 -0.223045 -0.232264 -0.232264 0.365549 0.365552 0.279747 0.279754 0.259611 0.259611 0.239471 0.239471 0.240827 0.240828
chargesum: 0.00000
title: Mulliken charges with hydrogens summed into heavy atoms:
elementType: Cl Cl Cl Cl O O N N C C C C C C C C C C C C C C C C C C
charge: 0.038240 0.038243 -0.033078 -0.033082 -0.219526 -0.219531 -0.091347 -0.091330 0.493513 0.493375 -0.541686 -0.541639 0.120898 0.121003 0.561572 0.561582 -0.365151 -0.365152 -0.040198 -0.040185 0.051745 0.051744 0.016435 0.016427 0.008563 0.008564
polarizability: 5.48350948e+02 -1.14209599e+01 2.49741776e+02 -8.58449881e-04 1.18319485e-03 1.65715532e+02
1716.lowfreq: 0.0015 0.0025 0.0028 1.0198 3.8513 8.5555 18.6220 29.7421 30.3369
frequency: 18.6168 29.7411 30.3324 47.7778 58.1578 62.5577 82.8138 95.0575 114.9755 129.0651 155.1801 169.0135 180.5954 194.8235 201.2287 210.5183 225.0242 270.0401 282.0933 295.8072 306.6428 313.6288 356.6438 366.4780 378.7850 407.5246 415.2838 447.2844 448.4392 456.0751 487.3760 522.1418 530.7994 556.2731 562.6564 569.0055 606.1230 635.1075 662.0700 667.5204 711.8394 715.6001 729.8110 740.7850 751.8906 753.1464 758.5180 769.7679 774.8012 794.0945 853.3180 855.8593 866.3713 877.6155 885.5271 942.3875 943.1715 982.3185 982.5363 1000.4532 1019.1716 1021.5968 1039.5488 1039.5528 1129.5327 1132.3090 1170.5990 1173.8121 1175.6852 1191.0870 1232.5316 1242.4696 1274.9949 1275.3758 1320.7960 1330.5675 1376.2208 1376.4134 1432.4023 1432.5565 1457.3602 1458.7162 1494.0253 1502.7319 1549.1113 1561.1767 1582.5209 1586.3245 1601.5089 1602.0283 1610.7467 1623.8626 3146.2690 3146.2794 3160.8007 3160.8136 3174.5058 3174.5212 3183.2123 3183.2477 3285.8861 3290.8067
redmass: 9.6709 8.9507 10.5025 8.3856 9.6836 8.9043 10.3325 15.0679 16.6175 10.9490 5.7936 5.1135 9.6387 12.4020 8.3772 8.9292 10.1525 14.1996 6.1159 7.1089 8.4558 12.4215 7.0411 14.3970 8.3732 9.2813 8.5986 3.4876 3.4244 10.6521 7.5295 4.3081 3.8949 7.2668 9.0087 7.5334 7.2875 7.4633 6.7772 6.1488 4.3231 4.4387 4.5478 6.5584 2.6136 1.3587 1.8421 2.4641 1.6767 2.0808 1.4647 1.4207 6.1101 3.7700 4.1852 1.3707 1.3767 1.3383 1.3292 8.2151 7.1281 7.8640 2.0556 2.0623 1.6612 1.5931 3.0941 1.1025 1.2004 3.2551 2.4588 2.1243 3.1172 2.1418 2.1407 2.5259 8.6950 8.7371 2.4841 2.4756 2.3460 2.2431 2.8957 3.7925 3.5900 5.5004 3.8003 3.5410 6.9826 6.8388 10.8142 11.7959 1.0863 1.0863 1.0908 1.0908 1.0950 1.0950 1.1004 1.1004 1.0735 1.0740
irintensity: 0.3656 0.6603 0.1329 0.4925 0.1548 0.5783 0.3691 1.9651 1.2629 0.9302 0.6408 0.0497 0.6872 0.2405 0.0273 4.9533 0.3659 0.0422 5.4981 3.5773 0.5566 1.0242 4.8302 28.5369 4.9273 1.0017 17.3095 7.1779 9.8558 2.7797 8.1260 1.0874 16.9025 0.0032 135.3594 0.5987 3.5961 3.9101 8.4634 18.0098 6.1779 6.1661 19.6721 47.7481 26.2964 60.3999 45.6476 36.7424 146.1175 14.8836 2.3394 6.2752 1.6491 67.2032 29.0042 2.6260 3.2388 0.2308 0.0139 33.9885 50.7096 67.3188 17.9330 0.5566 0.9288 10.1520 64.4257 0.0534 6.3208 0.1595 7.2153 32.4597 159.3417 1.1501 54.2131 0.3031 29.1627 0.0901 102.1855 13.0386 17.4853 142.3977 1246.4806 5.8013 10.2655 146.9992 10.6375 171.6031 0.0525 40.2722 463.2234 19.4237 0.5288 1.3037 13.8641 5.8472 13.0500 0.7066 14.5118 6.3791 3.3656 186.3758
temp: 298.150 k
press: 1.00000 atm
elementType: 17 17 17 17 8 8 7 7 6 6 6 6 6 6 6 6 6 6 6 6 6 6 6 6 6 6 1 1 1 1 1 1 1 1 1 1
symmnumber: 1
zpe: 623031.7 jmol-1
zpe.correction: 0.237300 hartree
zpe.thermalcorrener: 0.260345 hartree
zpe.thermalcorrenthalpy: 0.261289 hartree
zpe.thermalcorrgfe: 0.182132 hartree
zpe.sumelectzpe: -2790.295930 hartree
zpe.sumelectthermal: -2790.272885 hartree
zpe.sumelectthermalent: -2790.271941 hartree
zpe.sumelectthermalfe: -2790.351098 hartree
dipole: -0.0002 -0.0001 4.1819
dipole: 4.1819
quadrupole: -131.9714 -193.1635 -172.6325
quadrupole: 12.7882 0.0010 -0.0019
quadrupole: 33.9511 -27.2410 -6.7100 12.7882 0.0010 -0.0019
hfenergy: -2790.53323 hartree
pointgroup: C01 [X(C18H10Cl4N2O2)]
dipole: 0.0000259 1.6453011 -0.0006208 debye
polarizability: 548.508326|0.0196125|165.7155435|9.1333894|0.030286|249.5843863 unknown
InChI: InChI=1S/C18H10Cl4N2O2/c19-9-5-1-3-7-11(9)23-15-13(21)18(26)16(14(22)17(15)25)24-12-8-4-2-6-10(12)20/h1-8,23-24H
charge 0 multiplicity 1
36 atoms
Cl -2.024683 -0.638726 2.534449
Cl 2.024852 -0.640221 -2.5336
Cl -5.243665 -1.369463 -1.797538
Cl 5.243932 -1.36779 1.798835
O  0.979208 -0.423469 2.550166
O  -0.979068 -0.425623 -2.549444
N  -2.729767 -0.137895 -0.647434
N  2.729889 -0.137268 0.647915
C  -1.438835 -0.229055 -0.194871
C  1.438955 -0.228791 0.195432
C  -0.952897 -0.338371 1.104476
C  0.95303 -0.338972 -1.103842
C  0.46683 -0.334043 1.383596
C  -0.466695 -0.33486 -1.382975
C  -3.904634 0.339941 -0.021084
C  3.904701 0.340254 0.021223
C  -5.172856 -0.112107 -0.477689
C  5.172975 -0.111361 0.478109
C  -3.879274 1.348084 0.981172
C  3.879224 1.347692 -0.98174
C  -6.374907 0.382818 0.053142
C  6.374968 0.383311 -0.05309
C  -5.078818 1.8464 1.52461
C  5.078709 1.845743 -1.52555
C  -6.328051 1.364402 1.069639
C  6.327998 1.364184 -1.070267
H  -2.787115 -0.347079 -1.663751
H  2.787279 -0.345827 1.664358
H  -2.91747 1.74871 1.31114
H  2.917374 1.747984 -1.311981
H  -7.330052 0.002406 -0.319486
H  7.330157 0.003249 0.319782
H  -5.036467 2.619693 2.297969
H  5.036268 2.618486 -2.299453
H  -7.260886 1.750342 1.492127
H  7.260788 1.749918 -1.493044
