program: Gaussian 09
title: 000265712
version: EM64L-G09RevD.01
frameworkgroup: C1[X(C17H16O6)]
method: RPBEPBE
basis: SDD
operation: Freq
keyword: #pfreq=noraman
keyword: PBEPBE/SDD
title: #p freq=noraman PBEPBE/SDD
converged: YES YES NO NO
title: Mulliken charges:
elementType: O O O O O O C C C C C C C C C C C C C C C C C H H H H H H H H H H H H H H H H
charge: -0.293734 -0.251502 -0.416477 -0.423451 -0.241472 -0.254932 0.180956 -0.061131 0.281784 0.129219 0.229981 0.293927 -0.324935 -0.400436 -0.362710 -0.537577 0.362437 -0.379013 -0.522634 -0.237367 -0.222010 -0.234662 -0.535575 0.281260 0.279968 0.270896 0.280489 0.375308 0.384006 0.248271 0.233900 0.234968 0.235554 0.230397 0.229007 0.230557 0.250564 0.227377 0.228790
chargesum: 0.00000
title: Mulliken charges with hydrogens summed into heavy atoms:
elementType: O O O O O O C C C C C C C C C C C C C C C C C
charge: -0.293734 -0.251502 -0.041169 -0.039445 -0.241472 -0.254932 0.180956 -0.061131 0.281784 0.129219 0.229981 0.293927 -0.043675 -0.120468 -0.091814 -0.257088 0.362437 -0.130741 0.181788 -0.006970 0.006996 -0.004105 0.171157
polarizability: 3.07198967e+02 1.10385772e+01 2.02347657e+02 7.56883672e-01 1.56084068e+01 1.29499373e+02
1716.lowfreq: -6.1908 -0.0006 -0.0002 0.0004 1.6511 6.5833 37.0676 45.5355 59.9276
frequency: 37.0653 45.5131 59.9270 68.6476 88.5845 103.7345 108.4316 127.8757 143.6190 170.1398 193.2732 203.1669 209.9360 223.1470 225.5300 248.2827 260.7757 275.6548 301.3139 308.1471 328.6368 339.0121 366.6517 385.1420 405.5762 437.8521 455.0483 483.8081 504.2031 520.2535 549.2352 551.2369 577.4390 609.0208 615.4838 626.6086 670.9977 679.4163 687.3157 706.5056 723.2328 753.7602 764.9581 815.3582 837.2340 864.1260 875.1301 879.5365 905.4313 920.9556 942.2442 950.6061 968.8156 986.8915 991.0956 993.3403 1000.7561 1003.7804 1019.9710 1038.6970 1057.9571 1085.3622 1098.0616 1111.1345 1118.2912 1122.7609 1139.6303 1159.8071 1171.6859 1173.2497 1188.2679 1215.8342 1244.9589 1266.6955 1275.0123 1310.3728 1317.9237 1380.1030 1384.5616 1398.0891 1425.3190 1434.9139 1436.6338 1443.8133 1457.6147 1468.2283 1470.7231 1477.7642 1479.9444 1489.5407 1560.0142 1590.3807 1598.3083 1612.3101 1632.9768 2971.4586 2982.1532 3064.8058 3077.8811 3127.4327 3127.6083 3133.2827 3140.6201 3150.4384 3156.3090 3170.8564 3177.0761 3179.4536 3183.2514 3373.5460 3530.6029
redmass: 4.2385 4.3254 5.7109 5.2585 4.1932 2.5836 4.1738 1.4373 3.3777 3.2057 3.9690 1.8574 1.3311 3.5302 2.4057 3.8985 4.5238 5.0967 4.8593 5.4599 5.8559 6.9429 8.2098 5.7420 2.9094 5.6352 3.3517 5.3271 3.6602 1.5036 5.2945 3.3381 8.7419 6.2615 6.4088 5.2288 6.2733 5.5107 4.2580 1.9498 5.9748 3.1485 2.0643 1.6663 3.8307 1.3127 1.8788 3.8701 5.9423 6.2717 1.6479 5.3840 1.3832 2.0615 4.2045 2.4543 2.7536 1.4758 4.7240 2.4344 4.8887 1.6326 2.7172 1.2572 1.3060 2.0425 1.5798 1.4866 1.5631 1.0599 1.1189 1.8437 3.8975 3.8317 1.5540 2.0936 1.3762 4.2653 3.8154 3.6001 1.1703 1.7238 1.3753 4.2943 1.0644 1.0505 1.1134 1.0600 2.2605 2.9240 7.9824 6.3440 10.5075 6.0478 7.5278 1.0324 1.0304 1.1045 1.1039 1.0916 1.0961 1.1003 1.0899 1.0890 1.0953 1.0960 1.0950 1.0968 1.0926 1.0638 1.0652
irintensity: 1.0914 0.8806 0.6448 0.7739 1.7252 2.4149 7.6380 0.2991 4.4384 2.0343 5.1885 29.5022 40.5765 21.2277 2.7686 16.9749 4.9782 4.1969 6.3737 0.6801 5.6307 30.0540 11.8316 8.2853 0.6795 5.8442 0.5892 14.8443 1.8016 36.3472 11.4467 138.8168 1.2727 8.7996 1.8307 5.9013 9.9398 6.6085 23.1179 39.4669 15.8472 57.3536 18.8477 30.5879 14.4428 10.4600 49.8396 164.7535 28.1356 71.9989 5.0239 52.0052 2.6241 30.7133 54.6214 105.3180 23.2671 12.6804 131.7488 61.8913 59.8570 22.7871 196.8663 0.1996 22.9024 114.1762 67.0955 15.3464 91.6504 0.7892 10.3141 34.2321 105.1153 204.0908 12.7615 139.0581 20.1177 48.1176 62.7049 59.9926 6.3984 19.9795 2.5051 42.1201 3.4229 15.9106 86.4838 7.4800 14.6973 38.6033 50.7514 7.1441 386.7582 2.2209 371.1844 72.7916 44.6921 39.2381 37.0939 5.7784 10.9849 20.6836 16.2940 0.1396 30.2997 9.8762 10.9335 6.7105 0.3094 62.4091 13.8640
temp: 298.150 k
press: 1.00000 atm
elementType: 8 8 8 8 8 8 6 6 6 6 6 6 6 6 6 6 6 6 6 6 6 6 6 1 1 1 1 1 1 1 1 1 1 1 1 1 1 1 1
symmnumber: 1
zpe: 774481.2 jmol-1
zpe.correction: 0.294984 hartree
zpe.thermalcorrener: 0.316170 hartree
zpe.thermalcorrenthalpy: 0.317114 hartree
zpe.thermalcorrgfe: 0.245660 hartree
zpe.sumelectzpe: -1107.056176 hartree
zpe.sumelectthermal: -1107.034990 hartree
zpe.sumelectthermalent: -1107.034046 hartree
zpe.sumelectthermalfe: -1107.105500 hartree
dipole: -2.2773 -3.4518 1.1396
dipole: 4.2895
quadrupole: -90.4947 -139.9330 -131.4171
quadrupole: -1.5538 -0.4040 1.8774
quadrupole: 30.1202 -19.3181 -10.8021 -1.5538 -0.4040 1.8774
hfenergy: -1107.3511599 hartree
pointgroup: C01 [X(C17H16O6)]
dipole: 0.8485368 -1.4256632 -0.3090734 debye
polarizability: 306.3012467|-14.538998|199.4814244|1.8396413|-22.5390561|133.2633258 unknown
InChI: InChI=1S/C17H16O6/c1-21-12-8-9-13-14(10-12)23-17(22-2,16(19,20)15(13)18)11-6-4-3-5-7-11/h3-10,19-20H,1-2H3
charge 0 multiplicity 1
39 atoms
O  0.021921 -0.785017 0.081455
O  -0.857672 0.444264 -1.788326
O  -0.763911 1.400751 1.764211
O  -1.725065 2.516689 -0.118027
O  0.846221 3.296647 -0.235537
O  4.59537 -2.040988 0.252995
C  -1.025036 0.183876 -0.379232
C  -0.758287 1.562096 0.313306
C  -2.368317 -0.425666 -0.005539
C  0.678746 2.060495 -0.009695
C  1.716014 1.037021 0.015651
C  1.35132 -0.345388 0.088385
C  -3.535738 0.089169 -0.62628
C  -2.482593 -1.442853 0.973222
C  3.093906 1.374599 -0.005442
C  2.33467 -1.343572 0.163768
C  3.7008 -0.975151 0.165967
C  4.091719 0.393496 0.073056
C  -0.959707 -0.74048 -2.664355
C  -4.804201 -0.420169 -0.277391
C  -3.756328 -1.949499 1.319655
C  -4.918624 -1.441682 0.695609
C  6.033164 -1.740612 0.25411
H  -3.434155 0.894072 -1.36041
H  -1.577259 -1.835482 1.443503
H  3.356197 2.436035 -0.068067
H  2.054832 -2.398445 0.213924
H  -1.7018 1.227145 2.043543
H  -1.230119 3.381555 -0.230031
H  5.145472 0.683064 0.068189
H  -1.945144 -1.229645 -2.55849
H  -0.157992 -1.465386 -2.437199
H  -0.838693 -0.345534 -3.683903
H  -5.70228 -0.017313 -0.75839
H  -3.83947 -2.738833 2.075021
H  -5.904827 -1.835746 0.965991
H  6.52625 -2.720028 0.332116
H  6.337681 -1.241367 -0.685073
H  6.308538 -1.111916 1.121708
