program: Gaussian 09
title: 000265762
version: EM64L-G09RevD.01
frameworkgroup: C1[X(C17H31ClN4O2)]
method: RPBEPBE
basis: SDD
operation: Freq
keyword: #p
keyword: freq=noraman
keyword: PBEPBE/SDD
title: #p freq=noraman PBEPBE/SDD
converged: NO YES NO NO
title: Mulliken charges:
elementType: Cl O O N N N N C C C C C C C C C C C C C C C C C H H H H H H H H H H H H H H H H H H H H H H H H H H H H H H H
charge: -0.093443 -0.341178 -0.322637 -0.416011 -0.415743 -0.413024 -0.433394 -0.062789 -0.062153 -0.413713 -0.417159 -0.416591 -0.418477 -0.416513 -0.412197 -0.415929 -0.411688 -0.378549 -0.379002 0.347869 0.343429 -0.351466 -0.325894 -0.336590 0.246428 0.246762 0.179189 0.277378 0.211538 0.192261 0.180046 0.285185 0.210874 0.194329 0.205581 0.194703 0.177338 0.205832 0.191280 0.208568 0.174210 0.207050 0.191232 0.197943 0.198011 0.192665 0.278722 0.277234 0.261627 0.260544 0.239313 0.269858 0.240281 0.287856 0.279003
chargesum: 0.00000
title: Mulliken charges with hydrogens summed into heavy atoms:
elementType: Cl O O N N N N C C C C C C C C C C C C C C C C C
charge: -0.093443 -0.341178 -0.322637 -0.137288 -0.138509 -0.125168 -0.154391 0.183639 0.184610 0.042854 -0.013361 0.048640 -0.013274 -0.016229 -0.029027 -0.016081 -0.030428 0.010626 0.011673 0.347869 0.343429 -0.089838 0.173963 0.173549
polarizability: 2.50872507e+02 1.23433523e+01 2.46174957e+02 -1.02725953e+01 1.73841722e+00 1.80262554e+02
1716.lowfreq: -7.1945 -5.7944 -0.0019 -0.0015 -0.0012 7.1326 20.6086 25.5808 35.5450
frequency: 20.0762 25.4869 34.8450 36.6453 43.1440 60.3231 65.5093 66.7400 88.9030 91.6214 98.7312 107.6163 160.5262 177.3879 192.2970 203.7562 213.9676 226.7861 237.2837 253.3651 271.6480 303.6918 313.2939 319.3800 329.9398 349.1141 361.7590 373.4467 394.3727 401.3274 449.5334 461.5200 464.2991 473.7566 481.1228 498.1799 524.6191 529.8923 574.5031 611.8586 619.2771 648.3767 691.0015 704.7841 709.9372 718.1111 773.9187 776.6023 798.8710 801.1763 831.0036 832.7486 855.2747 861.4456 862.5295 865.0299 872.3648 911.1965 924.9543 926.5640 945.3677 974.8350 990.7607 1000.2801 1013.8796 1016.2211 1039.5971 1042.7436 1044.4431 1056.4901 1060.7360 1090.9081 1091.6018 1102.2090 1112.7975 1115.2707 1132.5415 1145.7521 1154.8557 1155.7291 1164.5616 1175.6309 1189.4465 1209.4187 1216.7830 1224.2053 1237.8258 1238.4802 1254.5903 1260.2281 1262.9185 1271.8642 1272.5008 1300.3964 1301.3607 1317.1655 1320.9132 1329.7319 1330.5662 1330.8597 1332.2775 1332.9960 1343.2968 1348.8350 1349.7456 1357.8103 1358.7281 1361.7966 1367.7279 1372.0226 1447.1882 1451.4734 1451.8423 1451.9312 1452.3017 1461.1582 1463.9185 1464.2480 1468.8782 1471.0736 1471.2182 1475.6011 1478.0548 1480.3224 1495.1252 1506.1518 1618.8785 1628.7918 2944.2502 2949.0956 2962.5525 2963.6635 2965.0000 2965.4699 2968.9207 2970.9449 2978.4950 2979.8759 2981.0236 3002.8850 3022.4238 3023.1464 3026.1569 3027.0109 3035.6769 3036.5190 3043.1258 3043.8648 3044.2015 3044.5711 3045.3903 3053.6050 3055.1756 3056.1736 3089.0030 3539.5424 3541.4667 3549.9597 3550.1636
redmass: 4.2941 3.8575 3.6650 4.5415 4.2040 5.8548 6.1367 3.6163 4.8896 3.6583 3.7030 9.5832 6.2688 4.8287 3.6836 2.2457 2.3455 3.6533 2.9720 3.0686 2.4921 2.9251 2.1307 1.3644 1.5612 2.1724 1.9351 2.0333 2.5318 2.5890 2.9533 2.3693 2.2761 2.0491 2.1630 3.1133 1.6068 1.5181 2.2855 2.5729 2.5442 3.7577 4.2595 6.0623 8.0777 6.3747 1.5262 1.5458 3.2515 3.2181 1.6803 1.6723 2.7018 2.3261 2.4361 2.4595 2.3572 2.1197 1.3949 1.3925 2.7429 2.2017 2.7956 2.4426 2.6828 2.7051 1.7935 1.4550 1.5807 1.7810 1.8710 1.7625 1.7730 2.3515 1.1267 1.1328 2.5541 2.4260 1.5659 1.5906 1.8765 1.7397 2.0817 1.4159 1.6464 1.2478 1.3701 1.3680 1.3320 1.2481 1.2413 1.2551 1.2708 1.6070 1.6067 1.4930 1.5219 1.3653 1.4288 1.4427 1.3504 1.5003 1.3253 1.4020 1.3946 1.4426 1.4348 1.3907 1.3903 1.3640 1.1909 1.2402 1.1211 1.4971 1.1957 1.0891 1.1155 1.0864 1.0859 1.0854 1.0912 1.1066 1.2366 1.1625 1.6797 2.2099 4.9220 5.2972 1.0676 1.0667 1.0625 1.0667 1.0629 1.0655 1.0617 1.0622 1.0624 1.0619 1.0617 1.0650 1.0929 1.0922 1.0977 1.0978 1.0988 1.0983 1.0987 1.1007 1.0951 1.0923 1.0879 1.1001 1.1001 1.0881 1.0976 1.0765 1.0767 1.0767 1.0765
irintensity: 0.4880 0.2643 0.0792 3.3034 0.2037 10.4158 17.0094 2.0327 17.3798 2.0190 6.0147 4.9983 4.8537 0.4752 1.8541 1.1038 0.9714 7.4028 7.5378 2.1987 6.5477 3.0599 10.2183 0.9943 25.2257 2.8912 4.1996 10.7564 3.4016 8.7178 1.2512 11.4248 10.4945 19.9604 25.6661 20.7087 132.6253 276.0878 23.5164 5.4556 14.5399 25.0756 2.5774 0.8225 31.8769 5.0524 0.3982 0.5307 1.4834 4.0134 5.1227 2.3959 0.4224 17.3243 7.1306 11.1070 1.3151 3.7911 14.5809 18.5987 36.6461 3.4494 2.4822 11.2711 1.3698 18.9044 4.2498 2.2793 9.3759 4.6275 1.3414 1.3054 0.5924 17.2077 0.8775 0.7340 20.6721 21.5060 12.7591 2.2411 10.7049 26.2858 3.1644 45.1219 24.3327 65.9511 24.9641 13.1349 159.1515 2.1580 6.9470 5.0675 19.7701 1.3901 2.3225 9.5982 53.4234 0.8313 0.2586 0.1572 0.4328 10.8085 2.9947 6.5181 2.2941 5.0744 6.8129 0.7142 0.5426 3.6453 23.7183 9.3329 18.2317 105.7096 3.4125 4.3367 8.6839 4.8142 9.0440 2.4087 7.8275 4.3438 106.0359 72.2521 240.2163 795.8756 204.6861 264.5389 35.7499 33.1758 39.0756 26.7483 26.6403 7.8408 12.5814 73.6251 40.1434 41.9391 49.5672 46.7612 105.2654 65.4302 63.4869 71.1408 34.9053 43.1723 8.0103 39.8466 20.7916 51.8847 56.6298 14.9799 20.8906 30.7373 5.2842 14.6292 15.8291 9.9244 18.0134
temp: 298.150 k
press: 1.00000 atm
elementType: 17 8 8 7 7 7 7 6 6 6 6 6 6 6 6 6 6 6 6 6 6 6 6 6 1 1 1 1 1 1 1 1 1 1 1 1 1 1 1 1 1 1 1 1 1 1 1 1 1 1 1 1 1 1 1
symmnumber: 1
zpe: 1250675.7 jmol-1
zpe.correction: 0.476357 hartree
zpe.thermalcorrener: 0.501972 hartree
zpe.thermalcorrenthalpy: 0.502916 hartree
zpe.thermalcorrgfe: 0.418516 hartree
zpe.sumelectzpe: -1494.079551 hartree
zpe.sumelectthermal: -1494.053936 hartree
zpe.sumelectthermalent: -1494.052992 hartree
zpe.sumelectthermalfe: -1494.137392 hartree
dipole: -1.7860 0.8802 0.2087
dipole: 2.0020
quadrupole: -137.7396 -144.7829 -162.5121
quadrupole: -12.0989 0.8707 2.7384
quadrupole: 10.6053 3.5620 -14.1673 -12.0989 0.8707 2.7384
hfenergy: -1494.5559079 hartree
pointgroup: C01 [X(C17H31Cl1N4O2)]
dipole: 0.7692543 -0.150305 0.0777372 debye
polarizability: 244.3401364|11.6848085|252.7249334|10.3467432|2.0137886|180.2449485 unknown
InChI: InChI=1S/C17H31ClN4O2/c18-13(11-19-16(23)21-14-7-3-1-4-8-14)12-20-17(24)22-15-9-5-2-6-10-15/h13-15,19-22H,1-12H2
charge 0 multiplicity 1
55 atoms
Cl -1.280742 -5.144533 -0.313472
O  -0.277648 -0.271537 1.69155
O  0.421941 -0.39089 -1.600421
N  -2.434196 -0.094753 0.787929
N  2.609597 -0.136297 -0.796985
N  -1.415874 -2.201429 1.015335
N  1.645562 -2.277788 -0.932209
C  -2.429741 1.38594 0.7579
C  2.578326 1.345388 -0.834283
C  -1.990235 1.926787 -0.632834
C  -3.821853 1.938012 1.156753
C  2.128422 1.940501 0.530644
C  3.961636 1.901167 -1.256886
C  -3.064562 1.687073 -1.720508
C  -4.893818 1.693432 0.064687
C  3.205326 1.766813 1.628031
C  5.036893 1.724709 -0.154764
C  -4.440192 2.261802 -1.30224
C  4.57185 2.34469 1.185913
C  -1.316184 -0.813588 1.187489
C  1.493572 -0.889936 -1.132663
C  0.158951 -3.944459 0.148955
C  -0.295635 -3.077466 1.331679
C  0.527512 -3.19539 -1.150132
H  -1.679599 1.687697 1.510317
H  1.823901 1.601246 -1.599223
H  -1.807782 3.017449 -0.535202
H  -1.038404 1.445088 -0.920804
H  -4.133602 1.494058 2.12116
H  -3.722399 3.030932 1.314618
H  1.930588 3.02278 0.383152
H  1.183092 1.460844 0.842047
H  4.282095 1.420854 -2.200889
H  3.843458 2.983987 -1.46295
H  -2.734004 2.137309 -2.675878
H  -3.158986 0.597827 -1.913036
H  -5.094254 0.604844 -0.039192
H  -5.853571 2.150719 0.373736
H  3.316968 0.688932 1.869984
H  2.865502 2.253596 2.561736
H  5.257725 0.645493 -0.002512
H  5.988316 2.185068 -0.4842
H  -4.362483 3.366413 -1.223746
H  -5.201131 2.048123 -2.078186
H  5.335482 2.178107 1.97074
H  4.476435 3.443299 1.059044
H  -3.177951 -0.573269 0.277265
H  3.361509 -0.572646 -0.260868
H  0.954979 -4.638544 0.470861
H  0.538056 -2.414444 1.632524
H  -0.526802 -3.741402 2.187834
H  -0.32351 -2.579721 -1.486392
H  0.752752 -3.93431 -1.942239
H  -2.272083 -2.633349 0.664418
H  2.573003 -2.664124 -0.751183
