program: Gaussian 09
title: 000265699
version: EM64L-G09RevD.01
frameworkgroup: C1[X(C17H14O5)]
method: RPBEPBE
basis: SDD
operation: Freq
keyword: #pfreq=noraman
keyword: PBEPBE/SDD
title: #p freq=noraman PBEPBE/SDD
converged: YES YES NO NO
title: Mulliken charges:
elementType: O O O O O C C C C C C C C C C C C C C C C C H H H H H H H H H H H H H H
charge: -0.284326 -0.378100 -0.254474 -0.222633 -0.258063 0.195366 0.231581 0.088402 0.307935 0.022830 0.062957 -0.520362 -0.344914 0.341869 -0.375138 -0.416456 -0.378773 -0.350067 -0.347940 0.319384 -0.535735 -0.537112 0.272018 0.282986 0.258181 0.293195 0.255171 0.259405 0.245074 0.365312 0.224771 0.250516 0.226514 0.225086 0.224600 0.250939
chargesum: 0.00000
title: Mulliken charges with hydrogens summed into heavy atoms:
elementType: O O O O O C C C C C C C C C C C C C C C C C
charge: -0.284326 -0.012789 -0.254474 -0.222633 -0.258063 0.195366 0.231581 0.088402 0.307935 0.022830 0.062957 -0.248344 -0.061928 0.341869 -0.116957 -0.123261 -0.123603 -0.090663 -0.102866 0.319384 0.166067 0.163514
polarizability: 3.55429743e+02 -1.34022044e+01 2.39550264e+02 4.15551947e+00 8.46685873e+00 1.00480773e+02
1716.lowfreq: -4.9628 0.0004 0.0006 0.0007 2.8816 5.3770 35.1073 40.3634 53.4163
frequency: 35.1025 40.3537 53.4148 74.7435 88.0798 96.9191 140.1266 146.2514 161.7242 198.0709 204.4722 223.3714 235.4327 253.0233 265.1975 290.9626 302.4229 324.3718 351.6223 383.2122 395.8262 400.7905 446.3806 452.4354 458.3206 466.7791 485.0174 514.6651 547.6813 589.1239 597.0085 612.3747 630.0010 638.5974 660.5564 693.4347 717.5543 735.1182 768.5600 774.5087 822.5441 837.7453 839.5541 847.8580 849.4164 919.4313 951.9768 958.9283 977.3255 985.7187 988.6340 994.9406 1002.6106 1063.8772 1106.2824 1112.2001 1112.9768 1123.2785 1128.9367 1150.0657 1158.0833 1166.9109 1181.5514 1218.7652 1239.5377 1254.0193 1270.9999 1282.6493 1305.5544 1356.1970 1386.4838 1401.0963 1429.6018 1434.4744 1436.4515 1442.9421 1468.1758 1468.4819 1471.5382 1472.5124 1486.2446 1496.6328 1551.3997 1561.8328 1571.8390 1594.8464 1619.8701 1629.4440 2965.2118 2965.4169 3055.6156 3056.0306 3131.6386 3131.8373 3134.1827 3149.6635 3156.4107 3168.7714 3172.0451 3177.9253 3179.7079 3509.5393
redmass: 4.1435 4.9797 4.7408 4.7707 5.8997 4.2832 4.5352 4.6349 4.2651 2.6733 2.7689 1.6812 1.8927 2.1941 5.7252 4.4271 4.9141 6.7953 5.8602 5.3695 4.5405 2.6675 3.8811 1.6722 3.1381 4.1340 7.3210 3.2165 5.5060 7.6050 5.5307 5.3605 6.0148 7.3177 5.8249 3.3979 6.4680 4.3320 5.9814 4.1927 1.3569 1.6505 4.7786 1.6160 1.6650 5.2563 1.5032 5.4389 1.6840 3.5719 1.3217 3.5961 2.7150 3.2652 2.0394 1.2605 1.2612 1.5014 1.9262 1.4535 1.3264 2.0436 1.2508 2.0373 2.9204 7.0938 1.6359 2.6682 1.3374 4.3759 4.3325 6.4624 3.5210 1.3036 1.1764 4.5989 1.0505 1.0499 1.0798 1.1273 2.6634 2.5538 9.9499 8.2572 8.5373 9.3242 6.2676 7.3087 1.0328 1.0328 1.1042 1.1043 1.0997 1.0998 1.0898 1.0876 1.0887 1.0955 1.0964 1.0928 1.0957 1.0654
irintensity: 0.3871 0.2171 0.4411 0.3968 0.1405 4.6833 11.1704 2.5422 1.4616 1.6434 1.7832 0.8735 2.0638 0.9859 9.3034 1.6247 1.7504 6.3733 0.5684 9.8785 7.0865 25.2825 9.9029 93.4445 0.4643 1.2938 3.5891 5.3217 28.1537 35.8882 2.2314 2.4152 0.3874 3.0213 11.9196 10.3436 5.1010 0.0757 2.2189 12.4593 21.0786 5.6584 11.6915 53.2534 75.0643 22.4824 6.9977 21.9523 13.8030 39.1308 0.3681 19.4301 21.6308 19.2179 208.2191 0.8758 0.2242 18.3941 178.6809 38.0876 2.5708 176.7883 128.9815 45.6251 208.3483 111.1686 41.0632 68.5202 12.2375 27.1851 38.1264 70.3754 44.1090 2.2294 13.8590 114.4211 14.7851 15.0537 57.4413 32.9618 43.6086 127.7858 116.6051 71.8356 106.2315 189.3590 168.6070 187.2130 18.2730 107.0836 40.7481 46.1638 29.3115 19.6264 2.3523 8.5562 0.2405 7.7566 4.9738 1.5249 7.4703 34.6628
temp: 298.150 k
press: 1.00000 atm
elementType: 8 8 8 8 8 6 6 6 6 6 6 6 6 6 6 6 6 6 6 6 6 6 1 1 1 1 1 1 1 1 1 1 1 1 1 1
symmnumber: 1
zpe: 709026.9 jmol-1
zpe.correction: 0.270054 hartree
zpe.thermalcorrener: 0.289434 hartree
zpe.thermalcorrenthalpy: 0.290378 hartree
zpe.thermalcorrgfe: 0.221985 hartree
zpe.sumelectzpe: -1030.731103 hartree
zpe.sumelectthermal: -1030.711723 hartree
zpe.sumelectthermalent: -1030.710779 hartree
zpe.sumelectthermalfe: -1030.779172 hartree
dipole: 3.9510 -8.4613 -0.7422
dipole: 9.3678
quadrupole: -106.1652 -128.9043 -128.3317
quadrupole: 5.9049 -5.8507 4.9974
quadrupole: 14.9685 -7.7706 -7.1980 5.9049 -5.8507 4.9974
hfenergy: -1031.0011568 hartree
pointgroup: C01 [X(C17H14O5)]
dipole: 1.6208556 3.1303499 1.0757552 debye
polarizability: 356.0003345|10.8014039|227.4277161|1.4984566|39.3662232|112.0327295 unknown
InChI: InChI=1S/C17H14O5/c1-20-11-5-3-10(4-6-11)17-16(19)15(18)13-8-7-12(21-2)9-14(13)22-17/h3-9,19H,1-2H3
charge 0 multiplicity 1
36 atoms
O  -0.447589 0.417572 0.028647
O  0.727908 -3.095332 -0.456524
O  -4.927405 2.290758 0.346908
O  -2.014109 -3.409032 -0.665379
O  5.946059 0.740334 -0.059128
C  -2.398038 -1.050889 -0.261276
C  -1.836966 0.224986 -0.00952
C  0.411522 -0.684646 -0.180175
C  1.834685 -0.302036 -0.129412
C  -0.091666 -1.965981 -0.361376
C  -1.544613 -2.245463 -0.454364
C  -2.623749 1.378705 0.202442
C  -3.819188 -1.150585 -0.296453
C  -4.026903 1.240504 0.159039
C  -4.627226 -0.031173 -0.091646
C  2.79384 -0.910965 -0.995706
C  2.280816 0.709031 0.761973
C  4.147325 -0.542611 -0.943646
C  3.636541 1.088408 0.820268
C  4.578806 0.452959 -0.02934
C  -4.376363 3.625501 0.603383
C  6.448616 1.775392 0.851177
H  -2.123858 2.332644 0.384454
H  -4.248688 -2.139142 -0.487427
H  -5.718488 -0.094231 -0.117084
H  2.470118 -1.626244 -1.760525
H  1.552168 1.199065 1.415049
H  4.88515 -0.995727 -1.612276
H  3.945348 1.867942 1.522916
H  1.654508 -2.880875 -0.169359
H  -3.777286 3.637819 1.534245
H  -5.252036 4.280659 0.715631
H  -3.75602 3.970829 -0.245911
H  6.279536 1.495299 1.908645
H  5.977211 2.755013 0.642854
H  7.52793 1.832314 0.649998
