program: Gaussian 09
title: 000265654
version: EM64L-G09RevD.01
frameworkgroup: CS[SG(CHClS),X(C2H4)]
method: RPBEPBE
basis: SDD
operation: Freq
keyword: #p
keyword: freq=noraman
keyword: PBEPBE/SDD
title: #p freq=noraman PBEPBE/SDD
converged: NO YES NO NO
title: Mulliken charges:
elementType: Cl S C C C H H H H H
charge: -0.076330 0.148543 -0.281870 -0.602299 -0.602299 0.296950 0.284127 0.274526 0.274526 0.284127
chargesum: 0.00000
title: Mulliken charges with hydrogens summed into heavy atoms:
elementType: Cl S C C C
charge: -0.076330 0.148543 0.015080 -0.043646 -0.043646
polarizability: 3.56796997e+01 1.84789685e+00 7.96759925e+01 -3.05628625e-08 5.48372694e-08 5.14889179e+01
1716.lowfreq: -11.2424 0.0037 0.0038 0.0043 11.0667 11.7417 120.5357 245.5443 327.1177
frequency: 120.5079 245.5439 327.1177 435.0147 593.6536 601.8801 703.8272 847.6144 934.0120 960.0561 992.9302 1091.1631 1134.5928 1179.4540 1195.6389 1244.6267 1295.7612 1443.3926 1460.8174 3061.7978 3063.3247 3101.5688 3152.8564 3156.5398
redmass: 4.2830 4.7556 7.0995 2.6387 6.2515 5.7991 5.2298 1.2408 1.3098 2.6493 1.0237 3.5297 1.3003 1.2114 1.3843 1.2089 1.3174 1.0920 1.1138 1.0555 1.0575 1.0895 1.1121 1.1120
irintensity: 9.0397 4.2885 5.1114 0.1077 2.7628 50.5232 41.6132 1.1596 7.4407 26.9375 0.4229 0.5545 4.6342 23.9675 8.2381 22.7937 2.3820 8.1463 8.3437 30.9367 3.0428 5.4390 5.1316 15.5848
temp: 298.150 k
press: 1.00000 atm
elementType: 17 16 6 6 6 1 1 1 1 1
symmnumber: 1
zpe: 193458.2 jmol-1
zpe.correction: 0.073684 hartree
zpe.thermalcorrener: 0.079118 hartree
zpe.thermalcorrenthalpy: 0.080062 hartree
zpe.thermalcorrgfe: 0.043942 hartree
zpe.sumelectzpe: -975.015816 hartree
zpe.sumelectthermal: -975.010382 hartree
zpe.sumelectthermalent: -975.009438 hartree
zpe.sumelectthermalfe: -975.045558 hartree
dipole: 0.5182 0.4724 0.0000
dipole: 0.7012
quadrupole: -43.7459 -53.9956 -40.4833
quadrupole: 0.1474 0.0000 0.0000
quadrupole: 2.3290 -7.9207 5.5916 0.1474 0.0000 0.0000
hfenergy: -975.0895002 hartree
pointgroup: CS [SG(C1H1Cl1S1),X(C2H4)]
dipole: 0.1773081 0.0000011 0.2113513 debye
dipolederiv: -0.9060659 0.0000041 -0.0183902 0.0000025 -0.1799342 0. -0.181325 0.0000009 -0.1941502 -0.420211 0.0000014 0.0021121 0.0000027 -0.1813303 0.0000005 0.128951 -0.0000002 -0.1255834 1.1950671 -0.000006 0.098549 -0.0000055 0.0085516 0.0000017 0.1476238 0.0000014 0.2394836 0.0040906 -0.2048731 0.0419084 -0.043956 0.1583876 0.0730165 -0.0236636 0.0499501 0.0837487 0.0040935 0.2048757 0.0419035 0.0439574 0.1583822 -0.0730185 -0.0236651 -0.0499513 0.0837511 -0.0230005 0.0000001 -0.0468539 0.0000008 0.0797801 -0.0000014 0.0153162 -0.0000018 -0.0899744 0.0289071 0.0845544 -0.0699278 0.0229215 0.0453935 0.0318815 -0.0235191 0.0585802 -0.0510385 0.0441071 0.0543505 0.0103117 0.0068529 -0.0673138 -0.0766798 -0.0081002 -0.1058746 0.0524017 0.0441064 -0.0543516 0.0103136 -0.0068544 -0.0673095 0.0766821 -0.0080988 0.105877 0.052398 0.0289058 -0.0845555 -0.0699265 -0.0229218 0.0453929 -0.0318825 -0.0235193 -0.0585818 -0.0510367 unknown
polarizability: 79.4498217|-0.0001275|51.4889179|3.6488691|-0.0001753|35.9058705 unknown
InChI: InChI=1S/C3H5ClS/c4-3-1-5-2-3/h3H,1-2H2
charge 0 multiplicity 1
10 atoms
Cl -2.250154 0.00000118 -0.229323
S  1.947774 -0.00002195 -0.083484
C  -0.459155 -0.00000313 0.395136
C  0.400417 1.166775 -0.120274
C  0.40040334 -1.16680151 -0.12025094
H  -0.542736 0.00000819 1.491931
H  0.180573 1.444542 -1.161405
H  0.484972 2.048228 0.529402
H  0.48494802 -2.04824266 0.52944247
H  0.18055609 -1.44458651 -1.16137646
