program: Gaussian 09
title: 000265652
version: EM64L-G09RevD.01
frameworkgroup: C1[X(C3H6O2S)]
method: RPBEPBE
basis: SDD
operation: Freq
keyword: #pfreq=noraman
keyword: PBEPBE/SDD
title: #p freq=noraman PBEPBE/SDD
converged: NO NO NO NO
title: Mulliken charges:
elementType: S O O C C C H H H H H H
charge: 0.982177 -0.556432 -0.556428 -0.537531 -0.537531 -0.421690 0.277731 0.277705 0.277705 0.277731 0.258293 0.258268
chargesum: 0.00000
title: Mulliken charges with hydrogens summed into heavy atoms:
elementType: S O O C C C
charge: 0.982177 -0.556432 -0.556428 0.017905 0.017905 0.094872
polarizability: 7.22960928e+01 -4.63243033e-04 6.03176060e+01 3.34272264e-06 5.47427010e-05 5.34274200e+01
1716.lowfreq: -90.4569 -12.8779 -0.0011 0.0002 0.0036 3.8323 25.2012 176.5207 194.9821
frequency: -90.3877 176.4503 194.9696 238.1221 281.3228 456.3504 557.5729 662.2551 722.6324 725.2541 823.9495 849.3829 919.9501 952.9371 982.4394 985.0489 1084.9748 1136.3479 1160.6995 1208.1012 1230.5907 1414.3732 1425.0146 1468.0160 3049.9974 3063.2410 3067.3851 3118.9705 3165.4035 3171.1085
redmass: 1.8000 3.4215 4.1804 6.6434 8.9644 10.7715 9.7638 4.7795 1.2502 1.1668 15.3931 1.6942 3.1125 1.0089 4.0792 4.3781 1.1520 1.3917 1.3531 1.0874 1.2866 1.0988 1.0985 1.0934 1.0567 1.0554 1.0592 1.1075 1.1132 1.1130
irintensity: 2.0636 0.0000 1.4278 12.4893 14.6574 8.0110 69.5094 3.2034 0.0000 6.3754 75.3048 19.4139 9.0595 0.0000 83.1100 0.0526 1.4939 1.5893 5.5926 0.0002 21.8450 20.9517 1.5028 3.0796 16.5255 7.1791 0.3905 4.5963 0.0000 5.3985
temp: 298.150 k
press: 1.00000 atm
elementType: 16 8 8 6 6 6 1 1 1 1 1 1
symmnumber: 1
zpe: 229042.2 jmol-1
zpe.correction: 0.087238 hartree
zpe.thermalcorrener: 0.093391 hartree
zpe.thermalcorrenthalpy: 0.094336 hartree
zpe.thermalcorrgfe: 0.057211 hartree
zpe.sumelectzpe: -665.754984 hartree
zpe.sumelectthermal: -665.748830 hartree
zpe.sumelectthermalent: -665.747886 hartree
zpe.sumelectthermalfe: -665.785011 hartree
dipole: -6.1634 -0.0010 0.0000
dipole: 6.1634
quadrupole: -47.8511 -49.9344 -38.9179
quadrupole: 0.0009 0.0000 -0.0002
quadrupole: -2.2833 -4.3666 6.6499 0.0009 0.0000 -0.0002
hfenergy: -665.8422215 hartree
pointgroup: C01 [X(C3H6O2S1)]
dipole: -2.4247657 0.0207644 -0.0000581 debye
dipolederiv: 1.2914427 -0.0002196 0.0000028 -0.0001436 1.267109 0.0000215 0.0000027 0.0000212 1.1787079 -0.6405865 -0.0403107 -0.0000138 -0.2560897 -0.6669563 -0.0000486 -0.0000685 -0.0000427 -0.5005575 -0.6355482 0.0398063 0.0000071 0.2555112 -0.6720511 -0.0000374 0.0000612 -0.0000416 -0.5005556 -0.0763061 0.0004774 0.1244899 0.0004927 -0.0180151 -0.0010081 0.0850908 -0.0006817 -0.1497943 -0.0762945 0.0005402 -0.1244853 0.0005379 -0.0180159 0.0010781 -0.0850863 0.0007498 -0.149804 0.0217387 0.0008797 0.0000061 0.0007784 0.1201524 0.0000856 0.0000061 0.0000858 -0.215371 0.0381419 0.0162068 0.0447121 -0.0133392 0.008566 -0.0803673 0.0041695 -0.0636108 0.0310474 0.0380404 -0.0167565 0.0461101 0.0128354 0.0084744 0.0795387 0.0052939 0.0635195 0.0311804 0.0380433 -0.0167301 -0.046119 0.0128419 0.0085474 -0.0795505 -0.005287 -0.0635325 0.0311037 0.0381439 0.0162262 -0.0447037 -0.0133415 0.0084926 0.0803543 -0.0041763 0.0635994 0.0311191 -0.019891 -0.0642532 -0.0000197 -0.1009009 -0.0216418 -0.0000354 -0.0000289 -0.0000343 0.1064948 -0.0169246 0.0641334 0.0000134 0.1008174 -0.0246615 -0.0000309 0.0000229 -0.0000319 0.1064291 unknown
polarizability: 72.2951738|-0.1049196|60.3185246|0.0004659|0.0016651|53.4274204 unknown
InChI: InChI=1S/C3H6O2S/c4-6(5)2-1-3-6/h1-3H2
charge 0 multiplicity 1
12 atoms
S  0.751394 -0.108936 -0.000001
O  1.560258 1.304768 0.000377
O  1.536034 -1.536244 -0.00034
C  -0.825711 -0.095722 1.21892
C  -0.825648 -0.095097 -1.218996
C  -1.800685 -0.086651 -0.000061
H  -0.787781 0.817938 1.8295
H  -0.803706 -1.010489 1.828623
H  -0.803614 -1.009552 -1.829168
H  -0.787686 0.818876 -1.829105
H  -2.446473 -0.977747 -0.000305
H  -2.43028 0.815955 0.000154
