program: Gaussian 09
title: 000024629
version: EM64L-G09RevD.01
frameworkgroup: C1[X(C10H21NO2)]
method: RPBEPBE
basis: SDD
operation: Freq
keyword: #p
keyword: freq=noraman
keyword: PBEPBE/SDD
title: #p freq=noraman PBEPBE/SDD
converged: YES YES NO NO
title: Mulliken charges:
elementType: O O N C C C C C C C C C C H H H H H H H H H H H H H H H H H H H H H
charge: -0.277561 -0.247446 -0.570649 -0.361872 -0.371298 -0.374957 -0.356756 -0.523037 -0.394310 0.242445 0.037614 -0.685034 -0.682780 0.192658 0.187184 0.190906 0.191257 0.220169 0.209509 0.217544 0.180038 0.245021 0.241509 0.178366 0.206804 0.230554 0.257891 0.271648 0.207291 0.230902 0.223112 0.211391 0.253147 0.218740
chargesum: 0.00000
title: Mulliken charges with hydrogens summed into heavy atoms:
elementType: O O N C C C C C C C C C C
charge: -0.277561 -0.247446 -0.041110 0.017970 0.010865 0.054721 0.040826 -0.036507 -0.009140 0.242445 0.268167 -0.023730 0.000499
polarizability: 1.64896141e+02 1.51503176e+00 1.10423490e+02 -1.14817960e+00 -1.50763373e+00 9.71343750e+01
1716.lowfreq: -32.4052 -20.3100 -2.1568 -0.0003 0.0006 0.0007 10.5561 29.4367 43.7198
frequency: -28.9369 28.4863 43.2225 45.2668 60.4086 80.5901 101.9230 116.4222 130.4164 151.3703 178.6210 188.9473 200.5768 231.6691 239.8688 282.1896 325.9403 384.9615 415.5124 417.4026 453.1461 501.5447 558.9794 609.7122 678.5791 722.8966 743.3167 772.9336 789.5971 866.8621 875.9781 919.5826 925.3733 941.3612 946.3415 974.6341 1014.4249 1040.8224 1071.0021 1078.3663 1095.4413 1097.3875 1106.8739 1120.8198 1135.0713 1156.3678 1183.5280 1197.2311 1215.6931 1244.9930 1261.3572 1279.5583 1287.9714 1289.7923 1292.7450 1316.6993 1330.0257 1336.2173 1355.7240 1364.0851 1379.3928 1385.3973 1395.7429 1438.9521 1456.2331 1461.9307 1463.6853 1464.9281 1471.7065 1472.3543 1483.6115 1486.4029 1492.0926 1634.7534 1639.1474 2861.3783 2950.6003 2953.7461 2961.4436 2981.0604 2988.4116 2988.9780 2992.0859 2992.9209 3004.6447 3013.2558 3023.8710 3032.4100 3043.9372 3061.5785 3083.2246 3092.1400 3098.0231 3103.9526 3449.2670 3576.6066
redmass: 2.1168 3.3244 3.8248 2.3660 4.0522 2.2106 3.5487 2.5601 2.2676 2.2766 3.8072 1.0682 2.4813 1.1559 1.2838 3.7126 2.7491 3.7134 2.9827 3.2099 2.6452 2.9143 2.8036 1.2844 5.6206 1.0907 1.1342 3.6814 1.2364 1.3117 3.6457 3.5023 1.2100 1.4229 1.8057 1.5357 4.4491 2.3831 2.8923 2.0110 2.6344 2.0982 1.6899 1.7128 2.5379 2.0403 1.9060 1.5400 1.3456 1.4018 1.2585 1.0416 1.3224 1.1095 1.1293 1.3535 1.5263 1.3390 1.5951 1.7351 1.2608 1.4718 1.2321 1.0862 1.0513 1.0781 1.0648 1.0479 1.0898 1.0504 1.0959 1.0482 1.0916 9.7221 1.0943 1.0714 1.0590 1.0623 1.0620 1.0632 1.0356 1.0965 1.0359 1.0607 1.0858 1.1002 1.0864 1.0976 1.1019 1.1025 1.0995 1.0987 1.1005 1.1005 1.0448 1.0973
irintensity: 1.6144 0.5676 0.4789 0.9544 2.4193 2.3549 1.7160 0.5664 1.7013 1.3142 5.3357 0.0591 3.9757 32.5378 13.9964 16.6714 5.3422 14.9172 1.8901 1.2965 8.1168 7.3992 3.9146 220.6165 2.2073 14.4904 0.8767 8.1110 2.9210 1.3494 4.9665 36.1753 2.3991 1.0137 0.5483 1.0601 30.8406 25.6932 7.1660 28.1364 122.4831 103.4499 14.3941 3.6478 188.4974 11.3513 6.0481 20.2381 15.5054 31.3093 11.6417 2.6925 19.5482 1.6701 1.3104 12.2345 16.9541 1.9858 7.1321 13.9217 33.3984 14.4425 15.8538 23.3337 6.6403 1.0012 0.3936 5.6730 0.3023 5.0455 13.3707 21.7917 8.2925 157.8044 39.9930 113.4457 2.5890 3.0808 85.0833 4.0325 15.5517 4.5176 26.4271 35.8653 43.2528 4.2116 7.2185 1.3067 81.5966 90.8060 4.8844 56.6394 23.6533 30.6816 2.2319 0.1414
temp: 298.150 k
press: 1.00000 atm
elementType: 8 8 7 6 6 6 6 6 6 6 6 6 6 1 1 1 1 1 1 1 1 1 1 1 1 1 1 1 1 1 1 1 1 1
symmnumber: 1
zpe: 784491.3 jmol-1
zpe.correction: 0.298797 hartree
zpe.thermalcorrener: 0.315216 hartree
zpe.thermalcorrenthalpy: 0.316160 hartree
zpe.thermalcorrgfe: 0.253150 hartree
zpe.sumelectzpe: -597.784212 hartree
zpe.sumelectthermal: -597.767793 hartree
zpe.sumelectthermalent: -597.766849 hartree
zpe.sumelectthermalfe: -597.829859 hartree
dipole: -0.3192 -0.9698 -0.3779
dipole: 1.0887
quadrupole: -64.0674 -85.0226 -82.8283
quadrupole: 4.7761 -9.3931 5.1574
quadrupole: 13.2387 -7.7165 -5.5222 4.7761 -9.3931 5.1574
hfenergy: -598.0830093 hartree
pointgroup: C01 [X(C10H21N1O2)]
dipole: 0.1363984 0.3303007 -0.2361454 debye
polarizability: 164.7246611|1.7145925|110.2878893|3.551281|-1.9198833|97.4414563 unknown
InChI: InChI=1S/C10H21NO2/c1-9(2)13-10(12)7-5-3-4-6-8-11/h9H,3-8,11H2,1-2H3
charge 0 multiplicity 1
34 atoms
O  3.082245 0.599141 0.185335
O  2.09734 -1.460078 -0.310058
N  -6.929862 0.43033 -0.062721
C  -1.867731 0.505151 -0.036745
C  -3.141477 -0.369854 -0.032107
C  -0.566748 -0.326709 -0.020514
C  -4.444686 0.459209 -0.048067
C  0.692902 0.561067 -0.01284
C  -5.716112 -0.413504 -0.047556
C  1.988006 -0.235335 -0.064708
C  4.453094 -0.033768 0.148315
C  5.411882 1.103572 -0.210909
C  4.734989 -0.683498 1.510575
H  -1.888395 1.183455 0.841819
H  -1.877929 1.158853 -0.93451
H  -3.121109 -1.04881 -0.910238
H  -3.132585 -1.022907 0.865498
H  -0.535218 -0.997816 -0.89969
H  -0.556777 -0.987618 0.868124
H  -4.484847 1.131481 0.830784
H  -4.451332 1.112794 -0.947069
H  0.720771 1.214545 0.879564
H  0.685932 1.247227 -0.884306
H  -5.653958 -1.134166 -0.901534
H  -5.734112 -1.020316 0.878756
H  4.42946 -0.808621 -0.640875
H  -6.990689 1.044466 -0.88194
H  -7.804301 -0.080763 0.093395
H  6.445658 0.718528 -0.27823
H  5.142336 1.553095 -1.181869
H  5.383326 1.894222 0.559395
H  5.745458 -1.13217 1.512572
H  4.003935 -1.481915 1.720749
H  4.687833 0.070413 2.316504
