program: Gaussian 09
title: 000265700
version: EM64L-G09RevD.01
frameworkgroup: C1[X(C18H20O4)]
method: RPBEPBE
basis: SDD
operation: Freq
keyword: #pfreq=noraman
keyword: PBEPBE/SDD
title: #p freq=noraman PBEPBE/SDD
converged: YES YES NO NO
title: Mulliken charges:
elementType: O O O O C C C C C C C C C C C C C C C C C C H H H H H H H H H H H H H H H H H H H H
charge: -0.288164 -0.443967 -0.333552 -0.454550 0.129164 0.149828 0.178829 0.381508 -0.765212 -0.756490 0.161195 0.282819 -0.365569 -0.398713 -0.371899 -0.411092 -0.278140 -0.523139 -0.223643 -0.246061 -0.226342 -0.233142 0.238805 0.244239 0.229542 0.219090 0.221940 0.258447 0.354477 0.355984 0.233815 0.251850 0.266434 0.293395 0.226282 0.249515 0.228087 0.239190 0.228728 0.231532 0.231814 0.233167
chargesum: 0.00000
title: Mulliken charges with hydrogens summed into heavy atoms:
elementType: O O O O C C C C C C C C C C C C C C C C C C
charge: -0.288164 -0.089490 -0.333552 -0.098566 0.129164 0.149828 0.178829 0.381508 -0.052626 -0.057013 0.161195 0.282819 -0.131754 -0.146864 -0.105465 -0.117697 -0.051858 0.193653 0.005085 -0.014529 0.005473 0.000025
polarizability: 2.68478813e+02 4.54514391e+00 1.86414304e+02 7.83193776e-01 1.54721384e+01 1.51290602e+02
1716.lowfreq: -13.7551 -8.3324 0.0005 0.0008 0.0009 5.2181 39.8501 60.5419 72.1840
frequency: 39.7856 60.5200 72.1543 78.7624 101.1903 111.2175 136.2464 143.8331 169.7675 183.1398 201.3047 228.1621 232.7743 259.7829 262.9689 288.9607 304.4412 314.3020 327.7886 330.1927 333.3330 356.9731 365.6762 388.0839 415.1386 441.4517 481.9602 492.9556 508.8049 528.0450 533.0839 567.4179 580.0524 584.8429 615.8140 627.9892 660.7451 667.9437 713.2658 729.3322 746.9924 762.4011 765.1481 816.6529 853.7391 862.2695 869.9030 879.6811 887.8200 908.8783 941.0908 945.1416 962.9514 971.8291 979.0664 989.5670 994.4812 1004.2768 1025.2280 1029.6505 1036.6267 1039.0898 1066.2803 1083.9719 1084.8772 1100.5399 1120.3580 1131.1979 1135.1165 1148.9645 1166.4839 1173.3646 1176.5265 1184.4989 1202.2999 1221.2141 1235.4801 1275.2886 1313.1621 1314.7895 1351.7062 1380.7164 1383.3077 1386.8988 1391.3421 1426.7527 1434.7197 1436.1637 1454.2157 1456.9558 1463.3161 1469.1911 1474.3411 1479.1589 1480.1617 1487.6372 1587.1685 1590.6308 1610.9691 1616.8430 2988.1761 3004.8109 3017.1381 3088.5919 3096.1662 3106.0862 3119.8191 3122.2566 3127.7216 3131.2960 3133.6211 3137.8114 3145.1872 3151.2317 3158.2064 3161.9893 3170.1657 3173.1206 3417.5251 3529.1576
redmass: 4.5662 3.9196 4.6961 3.8002 3.5383 1.5569 1.6384 1.3946 3.5050 1.1134 3.2317 4.4702 4.1065 3.9618 3.9794 4.7440 2.0031 1.9529 3.3185 3.2422 3.1718 3.1807 3.7652 5.3616 2.8837 4.9416 3.4793 3.5596 5.0866 3.2526 4.5514 4.5132 6.3111 1.2168 6.3496 4.0183 6.2360 5.4869 1.9749 3.8879 3.6647 1.6160 1.4178 4.2354 3.3292 1.4672 1.2593 2.6615 2.9320 3.8108 1.6270 1.3914 5.6163 3.3604 1.3168 5.0095 1.4459 1.3517 3.2825 2.2428 3.2303 2.4920 1.5027 1.8846 1.7813 2.2022 1.2740 2.3604 2.4406 1.6246 1.2948 1.0546 1.6897 1.1545 3.0038 2.9460 2.8071 1.5832 1.3430 1.8436 1.5740 7.7267 1.5174 4.0845 1.2119 1.2156 1.9908 2.1271 1.1208 1.0580 1.1094 1.2449 1.5135 2.1888 1.1187 1.0880 6.7152 6.5434 6.0877 7.0953 1.0296 1.0369 1.0356 1.1042 1.0980 1.0984 1.0988 1.1039 1.0851 1.0859 1.0996 1.0887 1.0896 1.0935 1.0943 1.0968 1.1005 1.0984 1.0648 1.0656
irintensity: 1.0889 0.7603 0.1707 1.6679 0.1427 1.0843 0.3703 1.2792 1.9190 0.9960 3.1012 0.9855 5.9006 2.6769 3.1110 4.5556 41.9974 77.2432 16.5677 3.6348 12.9598 1.5681 2.8577 18.0711 3.4697 8.1302 0.7517 4.7828 19.5764 6.0552 7.7215 2.4346 0.9846 129.9038 0.4320 9.2056 6.6244 7.8561 36.6911 4.1359 2.0468 112.4364 31.5726 8.2484 3.0826 0.8898 1.5270 4.8771 29.8207 48.5218 21.0779 1.8842 190.7205 33.0050 1.2485 0.5223 1.2489 6.7763 17.5109 23.9809 94.5787 17.6323 59.2707 42.6746 16.5548 27.4037 1.5441 0.7870 10.0513 14.0415 7.2383 0.0695 16.4774 32.2940 144.4736 5.9195 100.5379 26.3051 2.0390 23.4401 65.2183 0.5568 9.3224 20.7172 35.3856 9.8055 12.9844 52.6921 4.4294 2.8139 15.2909 10.9445 45.7460 11.1856 16.2325 22.0308 22.8187 9.3048 0.2429 13.2643 46.6369 17.1657 19.4938 30.8906 24.3518 26.2908 13.7666 15.5405 0.0540 2.9744 7.9585 7.9199 11.9233 21.5340 23.0323 21.3135 22.8628 9.4055 72.0733 4.0117
temp: 298.150 k
press: 1.00000 atm
elementType: 8 8 8 8 6 6 6 6 6 6 6 6 6 6 6 6 6 6 6 6 6 6 1 1 1 1 1 1 1 1 1 1 1 1 1 1 1 1 1 1 1 1
symmnumber: 1
zpe: 886369.3 jmol-1
zpe.correction: 0.337600 hartree
zpe.thermalcorrener: 0.358142 hartree
zpe.thermalcorrenthalpy: 0.359087 hartree
zpe.thermalcorrgfe: 0.290345 hartree
zpe.sumelectzpe: -997.177854 hartree
zpe.sumelectthermal: -997.157312 hartree
zpe.sumelectthermalent: -997.156368 hartree
zpe.sumelectthermalfe: -997.225110 hartree
dipole: 3.3206 -1.7106 0.8141
dipole: 3.8230
quadrupole: -114.8404 -129.0928 -126.8756
quadrupole: 4.6678 0.3417 -1.8841
quadrupole: 8.7625 -5.4899 -3.2727 4.6678 0.3417 -1.8841
hfenergy: -997.5154547 hartree
pointgroup: C01 [X(C18H20O4)]
dipole: -1.3099567 -0.6838736 -0.2803626 debye
polarizability: 268.4651073|-4.8142805|184.9561598|0.1580834|-16.974442|152.7624515 unknown
InChI: InChI=1S/C18H20O4/c1-16(19)14-11-7-8-12-15(14)22-18(21-3,17(16,2)20)13-9-5-4-6-10-13/h4-12,19-20H,1-3H3
charge 0 multiplicity 1
42 atoms
O  0.140418 -1.132969 0.197009
O  -0.049464 1.189146 1.799742
O  -0.328795 0.185885 -1.761677
O  1.679973 2.02809 -1.393049
C  0.002757 1.363813 0.33756
C  1.538822 1.515129 -0.009084
C  -0.570774 0.037295 -0.316719
C  2.26093 0.16265 0.110892
C  -0.81069 2.597367 -0.084737
C  2.189449 2.5901 0.877797
C  1.555104 -1.058811 0.219159
C  -2.043956 -0.218228 -0.000561
C  3.676567 0.087519 0.078186
C  2.213947 -2.300914 0.347688
C  -3.057716 0.311062 -0.838184
C  -2.410544 -0.943138 1.161689
C  4.35751 -1.141353 0.192861
C  -0.550042 -1.037193 -2.56329
C  3.621709 -2.341869 0.343971
C  -4.419096 0.118394 -0.519139
C  -3.774809 -1.129395 1.482502
C  -4.782477 -0.598634 0.6453
H  -0.393359 3.496869 0.395738
H  -0.781524 2.745217 -1.175716
H  -1.862873 2.496067 0.233557
H  3.241518 2.729455 0.581716
H  1.681712 3.558155 0.737804
H  2.138426 2.304458 1.938865
H  -0.999597 1.106317 2.075078
H  1.168599 1.39232 -1.970296
H  4.251563 1.01011 -0.047573
H  1.611889 -3.21033 0.441264
H  -2.771215 0.867722 -1.736933
H  -1.624478 -1.380995 1.783655
H  5.452008 -1.165041 0.16638
H  0.192013 -1.811422 -2.303779
H  -0.423192 -0.720733 -3.610066
H  -1.569963 -1.430807 -2.405579
H  4.139961 -3.301653 0.445448
H  -5.194511 0.528529 -1.175546
H  -4.048933 -1.692773 2.381387
H  -5.839467 -0.745411 0.893983
