program: Gaussian 09
title: 000265661
version: EM64L-G09RevD.01
frameworkgroup: C1[X(C15H12N2O2)]
method: RPBEPBE
basis: SDD
operation: Freq
keyword: #p
keyword: freq=noraman
keyword: PBEPBE/SDD
title: #p freq=noraman PBEPBE/SDD
converged: YES YES NO NO
title: Mulliken charges:
elementType: O O N N C C C C C C C C C C C C C C C H H H H H H H H H H H H
charge: -0.171980 -0.246418 -0.229528 -0.359115 0.380112 -0.625847 0.073128 0.154765 0.111362 -0.346337 -0.325720 0.468421 -0.227079 -0.231288 -0.417618 -0.306734 -0.199883 -0.226147 -0.261187 0.273819 0.274235 0.240988 0.278994 0.319623 0.237426 0.240552 0.224888 0.225324 0.223670 0.220701 0.226871
chargesum: 0.00000
title: Mulliken charges with hydrogens summed into heavy atoms:
elementType: O O N N C C C C C C C C C C C C C C C
charge: -0.171980 -0.246418 -0.229528 -0.039491 0.380112 -0.077793 0.073128 0.154765 0.111362 -0.105349 -0.046726 0.468421 0.010347 0.009265 -0.192730 -0.081410 0.023787 -0.005446 -0.034316
polarizability: 2.76166259e+02 3.05310587e+00 1.66448803e+02 9.61937532e+00 1.20016304e+01 1.15430213e+02
1716.lowfreq: -10.0308 -0.8544 -0.0007 -0.0006 0.0002 3.9828 18.6378 25.3171 43.4192
frequency: 18.6105 25.0033 43.3939 54.0245 107.2480 132.0705 182.5754 208.3188 249.2418 251.6676 294.1147 325.5907 373.9118 403.8788 417.4680 423.1779 449.7875 463.4724 483.9698 510.5168 537.7063 561.3989 607.0801 613.4468 628.9724 661.1327 680.9897 688.3245 731.3167 743.6265 753.1121 791.1362 814.0190 828.6563 851.2261 879.3953 882.9876 927.4912 941.2113 956.2077 978.6922 980.4957 983.2018 1007.0585 1024.5924 1035.2591 1075.7788 1097.9011 1105.3326 1142.9986 1171.2322 1175.9492 1186.4170 1196.9751 1204.5683 1231.8746 1247.9682 1273.4243 1320.0692 1322.1077 1327.9886 1388.5899 1396.7777 1420.9923 1438.9709 1447.8699 1482.1639 1486.6489 1510.2455 1573.3967 1601.1259 1604.5342 1616.6294 1618.4862 1642.7232 2977.8943 3045.8924 3121.6595 3127.4207 3130.9794 3143.7662 3143.9222 3158.1993 3159.8478 3171.7794 3173.2652 3488.0530
redmass: 5.0372 3.9008 6.2720 4.0195 7.5245 4.0923 4.3723 3.3117 4.9040 3.9340 5.5901 2.7075 9.4466 2.8730 5.0791 3.1198 3.4436 3.3871 5.7748 3.3897 7.5459 3.7056 5.0015 6.2707 6.3142 6.5678 4.5962 1.9764 2.5421 3.2330 1.9276 1.8189 1.3310 3.5040 4.3937 1.4817 1.3821 6.5446 2.2505 1.3725 1.3627 1.4230 4.9731 1.3397 2.1770 2.2040 2.5036 2.5510 2.3401 3.1817 1.0474 1.0691 1.1069 1.2564 1.9400 2.6573 1.8583 2.8438 2.1284 2.2978 1.7271 6.1569 7.3710 1.1068 2.2980 2.5631 2.5254 2.4278 1.4759 9.1187 5.8847 6.8097 7.0878 6.3632 9.2110 1.0665 1.0917 1.0862 1.0878 1.0868 1.0934 1.0897 1.0941 1.0950 1.0999 1.1000 1.0754
irintensity: 0.3988 0.5272 1.5396 3.9138 1.0029 5.0812 1.6330 2.1801 4.3663 9.9517 13.3643 31.5689 10.7430 0.6061 31.8452 5.7581 73.5575 0.9154 19.2111 14.8173 6.0452 1.6679 10.8929 1.8577 4.6451 9.1173 13.2210 31.6263 18.7047 21.4970 110.7077 28.2455 0.6385 9.4405 3.2812 3.8715 3.1248 23.5239 7.5955 0.7430 0.1892 3.9373 0.8663 0.1101 9.2611 9.1013 37.8125 0.5128 44.1427 144.6331 0.7864 4.0994 4.4253 2.3989 22.0791 111.7926 10.1962 216.2672 6.2177 37.3566 1.4905 15.7784 1.6776 19.0157 6.4954 22.0869 4.0169 102.0966 53.4409 161.3736 39.2558 66.6779 92.2718 122.3248 141.2844 2.9140 1.2272 9.1083 3.5558 0.5614 26.1816 11.1476 11.0840 47.9202 8.5248 20.9027 39.2575
temp: 298.150 k
press: 1.00000 atm
elementType: 8 8 7 7 6 6 6 6 6 6 6 6 6 6 6 6 6 6 6 1 1 1 1 1 1 1 1 1 1 1 1
symmnumber: 1
zpe: 620019.7 jmol-1
zpe.correction: 0.236153 hartree
zpe.thermalcorrener: 0.251546 hartree
zpe.thermalcorrenthalpy: 0.252490 hartree
zpe.thermalcorrgfe: 0.191181 hartree
zpe.sumelectzpe: -837.430718 hartree
zpe.sumelectthermal: -837.415325 hartree
zpe.sumelectthermalent: -837.414381 hartree
zpe.sumelectthermalfe: -837.475691 hartree
dipole: 4.3320 0.3740 1.6294
dipole: 4.6434
quadrupole: -88.5459 -113.1826 -109.8508
quadrupole: 8.8171 1.1988 8.4640
quadrupole: 15.3138 -9.3228 -5.9910 8.8171 1.1988 8.4640
hfenergy: -837.6668711 hartree
pointgroup: C01 [X(C15H12N2O2)]
dipole: -1.7199725 -0.2595655 -0.5583426 debye
polarizability: 276.5502587|4.6223809|140.895798|5.5492945|-28.1495355|140.5992171 unknown
InChI: InChI=1S/C15H12N2O2/c18-14-10-11-6-4-5-9-13(11)15(19)17(14)16-12-7-2-1-3-8-12/h1-9,16H,10H2
charge 0 multiplicity 1
31 atoms
O  0.547361 2.569003 -0.127649
O  -0.42076 -1.624404 1.642891
N  0.092832 0.37906 0.576292
N  1.383718 0.273034 1.135509
C  -2.612631 0.562322 -0.382142
C  -1.625436 1.654655 -0.731928
C  -2.211035 -0.551923 0.39838
C  -0.255821 1.610301 -0.062401
C  -0.823553 -0.677236 0.907828
C  -3.949817 0.629771 -0.840027
C  -3.13443 -1.583875 0.712955
C  2.503853 -0.006343 0.300944
C  -4.86735 -0.396717 -0.531312
C  -4.458912 -1.509243 0.246639
C  3.730332 -0.328471 0.942687
C  2.450095 0.056711 -1.113688
C  4.881413 -0.590131 0.174324
C  3.612891 -0.203874 -1.871094
C  4.833906 -0.529114 -1.23925
H  -1.435097 1.65293 -1.825392
H  -2.045123 2.65392 -0.513975
H  -4.272733 1.489095 -1.439651
H  -2.784419 -2.42456 1.320253
H  1.349727 -0.232055 2.028175
H  -5.899224 -0.331172 -0.893137
H  -5.172415 -2.304428 0.485475
H  3.778397 -0.365914 2.037811
H  1.515671 0.306177 -1.624047
H  5.81964 -0.839855 0.682418
H  3.5597 -0.150803 -2.964459
H  5.731219 -0.729263 -1.833727
