program: Gaussian 09
title: 000265630
version: EM64L-G09RevD.01
frameworkgroup: C1[X(C7H6N2O4S)]
method: RPBEPBE
basis: SDD
operation: Freq
keyword: #p
keyword: freq=noraman
keyword: PBEPBE/SDD
title: #p freq=noraman PBEPBE/SDD
converged: NO YES NO NO
title: Mulliken charges:
elementType: S O O O O N N C C C C C C C H H H H H H
charge: 0.387395 -0.412835 -0.210138 -0.185145 -0.212940 0.015469 0.022151 0.433699 -0.444889 -0.232654 -0.692854 -0.165973 -0.339190 0.217265 0.299705 0.314486 0.314657 0.248098 0.257357 0.386334
chargesum: 0.00000
title: Mulliken charges with hydrogens summed into heavy atoms:
elementType: S O O O O N N C C C C C C C
charge: 0.387395 -0.026501 -0.210138 -0.185145 -0.212940 0.015469 0.022151 0.433699 -0.444889 0.067051 -0.063711 0.082125 -0.081832 0.217265
polarizability: 1.91349997e+02 -1.61827355e+00 1.46100910e+02 -5.53758730e-02 1.71325765e-02 4.94980285e+01
1716.lowfreq: -8.1106 -7.3545 -2.4209 -0.0012 -0.0002 0.0016 11.6758 34.1062 64.5810
frequency: 10.6842 34.0920 64.5785 83.8177 111.4964 135.0300 181.3510 199.0897 223.0451 295.6463 351.8424 398.0876 435.1943 456.3194 490.3827 501.0886 524.0185 565.0304 632.6532 632.7657 674.8480 700.8331 733.3839 741.8709 800.1972 819.5207 873.1483 889.5110 958.6436 996.7017 1017.6042 1047.1292 1048.8290 1114.8648 1132.7556 1142.1091 1200.2551 1219.8802 1222.2905 1317.7196 1325.7867 1352.7285 1393.3503 1400.7718 1415.9695 1539.2373 1569.7727 1671.1345 3058.6925 3124.8479 3142.6745 3172.2836 3189.9335 3512.7659
redmass: 11.9528 9.2823 4.7641 8.8697 5.5001 4.3141 9.5317 10.6195 5.9885 8.8086 11.1072 10.9581 4.9252 12.2101 3.2192 1.8967 8.6059 4.6665 7.7011 1.3628 7.8142 9.3483 6.7904 3.5229 9.3593 1.5076 5.0114 1.7930 1.4046 1.3683 5.6755 2.4040 2.7216 2.2121 1.1472 1.9844 4.0900 2.1855 1.4271 2.7718 4.3746 6.4053 2.2784 1.1118 2.1392 6.1988 6.5636 8.8775 1.0587 1.1035 1.0905 1.0908 1.0998 1.0640
irintensity: 0.3486 0.0610 0.0968 0.5483 4.4792 1.8993 1.5155 9.0503 0.0149 3.5449 5.2331 22.3118 0.8127 0.3484 0.6897 39.3314 6.3830 52.9736 7.8294 140.9584 4.6583 15.6571 1.7670 23.8453 21.2777 40.3669 9.1125 8.6437 0.1013 1.9351 4.5681 368.1242 53.7502 16.5933 0.0675 17.6828 176.3818 80.2311 4.9260 116.1548 15.5891 54.5450 121.9142 17.1728 77.4453 80.7907 77.3146 181.0429 7.8603 0.1475 12.7106 5.0010 8.3277 30.6301
temp: 298.150 k
press: 1.00000 atm
elementType: 16 8 8 8 8 7 7 6 6 6 6 6 6 6 1 1 1 1 1 1
symmnumber: 1
zpe: 340028.1 jmol-1
zpe.correction: 0.129510 hartree
zpe.thermalcorrener: 0.142573 hartree
zpe.thermalcorrenthalpy: 0.143517 hartree
zpe.thermalcorrgfe: 0.086670 hartree
zpe.sumelectzpe: -1077.690346 hartree
zpe.sumelectthermal: -1077.677283 hartree
zpe.sumelectthermalent: -1077.676338 hartree
zpe.sumelectthermalfe: -1077.733185 hartree
dipole: 0.0773 6.5595 0.0059
dipole: 6.5600
quadrupole: -74.6848 -94.3147 -86.5475
quadrupole: -8.9962 0.0240 -0.0070
quadrupole: 10.4975 -9.1324 -1.3652 -8.9962 0.0240 -0.0070
hfenergy: -1077.8198556 hartree
pointgroup: C01 [X(C7H6N2O4S1)]
dipole: -0.1003538 2.5776212 -0.0822007 debye
dipolederiv: -0.1937166 0.2190145 -0.0067499 0.5598815 0.193458 -0.0058591 -0.0176574 -0.0055086 0.025668 -1.1208089 -0.5481616 0.0172664 -0.5552177 -0.6704895 0.0075624 0.0172874 0.0075161 -0.4313573 -1.0205337 -0.3234789 0.0126157 -0.2823031 -0.5597895 0.0116002 0.0117177 0.0119555 -0.2280236 -0.5456539 0.076272 -0.0015987 0.0313532 -0.6220032 0.0134093 0.0002228 0.013498 -0.2032993 -0.8130058 0.1839379 -0.005339 -0.0841197 -0.8587732 0.0172317 0.0028533 0.0172342 -0.2957353 -0.553535 0.0781076 -0.0021012 0.7199198 -0.665994 0.015527 -0.0232493 0.0163496 -0.1753247 1.2553599 0.2670966 -0.011962 0.497083 1.4197895 -0.0414553 -0.0200487 -0.0415777 0.1866968 -0.4529793 0.2022023 -0.0056717 -0.3819725 -0.6436678 0.0247595 0.0131059 0.0237137 0.083756 0.9932066 -0.2929814 0.0083059 -0.7899663 0.3810504 -0.0124611 0.0247265 -0.0131426 -0.0108144 0.012448 -0.2206605 0.0071235 0.129919 0.4175619 -0.0158395 -0.004295 -0.0148854 -0.0523647 -0.0806935 0.1157834 -0.0033481 0.3633802 -0.1440404 0.0076461 -0.0114139 0.0079762 0.1027489 -0.2463813 -0.3261805 0.0108761 -0.2436336 -0.3869788 0.00868 0.0085207 0.009142 -0.1422002 0.5846776 0.2258104 -0.0086313 -0.1610963 0.4516927 -0.0158268 0.0041935 -0.0165597 -0.0275296 1.7907609 0.224493 -0.0077909 0.20738 1.3083338 -0.0336898 -0.0070698 -0.0338352 0.2110217 0.0762486 -0.0078279 0.0004175 -0.0590572 0.1281168 0.0013823 0.0021446 0.0010971 0.1662222 0.0106874 -0.0178477 -0.0039384 -0.1024008 0.0464622 -0.0612145 0.0177371 -0.0468375 0.0443373 0.0112773 -0.0177722 0.0051398 -0.1033796 0.0534029 0.0607028 -0.011089 0.0461203 0.0379248 -0.0055212 0.0915119 -0.002687 0.0752795 0.0244089 0.0045935 -0.0021732 0.004545 0.1679028 0.0856699 -0.028024 0.0010347 0.0197473 -0.0888754 0.0075674 -0.0006886 0.0074716 0.1374597 0.2124929 0.098705 -0.0029615 0.1592032 0.2163347 0.005684 -0.0048248 0.0057272 0.4029107 unknown
polarizability: 191.3973693|0.6727334|145.9502203|-0.2181779|-3.1529925|49.6013457 unknown
InChI: InChI=1S/C7H6N2O4S/c10-6(11)4-14-7-5(9(12)13)2-1-3-8-7/h1-3,10H,4H2
charge 0 multiplicity 1
20 atoms
S  1.019193 -0.81383 -0.037862
O  4.660144 0.958698 -0.094507
O  -3.302102 -2.122377 0.014283
O  -1.053155 -2.533558 0.020725
O  3.974371 -1.26175 -0.025956
N  -0.269769 1.597015 -0.116307
N  -2.069811 -1.729953 -0.002237
C  -1.792465 -0.286684 -0.050554
C  -0.463088 0.243947 -0.070773
C  -2.903019 0.587517 -0.077118
C  2.309187 0.578633 -0.082061
C  -2.681809 1.974442 -0.123502
C  -1.341655 2.429425 -0.141704
C  3.686422 -0.048639 -0.063203
H  -3.905024 0.150312 -0.060629
H  2.170097 1.243819 0.783655
H  2.169381 1.189045 -0.987098
H  -3.512728 2.683747 -0.145171
H  -1.109135 3.499502 -0.17796
H  5.564968 0.542389 -0.08202
