program: Gaussian 09
title: 000265674
version: EM64L-G09RevD.01
frameworkgroup: C1[X(C15H13ClN2O2S)]
method: RPBEPBE
basis: SDD
operation: Freq
keyword: #p
keyword: freq=noraman
keyword: PBEPBE/SDD
title: #p freq=noraman PBEPBE/SDD
converged: YES YES NO NO
title: Mulliken charges:
elementType: Cl S O O N N C C C C C C C C C C C C C C C H H H H H H H H H H H H H
charge: -0.137119 1.067836 -0.501191 -0.508951 -0.564806 -0.059607 0.376899 0.298374 -0.767479 0.041290 0.568738 -0.337927 -0.342924 -0.711563 -0.216030 -0.222499 -0.406360 -0.329888 -0.231808 -0.241559 -0.231196 0.356324 0.283545 0.255056 0.293042 0.303809 0.281241 0.230796 0.232659 0.239217 0.289233 0.231574 0.229353 0.231924
chargesum: 0.00000
title: Mulliken charges with hydrogens summed into heavy atoms:
elementType: Cl S O O N N C C C C C C C C C C C C C C C
charge: -0.137119 1.067836 -0.501191 -0.508951 -0.564806 -0.059607 0.376899 0.298374 -0.411155 0.041290 0.568738 -0.054383 -0.087868 0.166529 0.014766 0.010160 -0.167143 -0.040655 -0.000234 -0.012206 0.000728
polarizability: 3.12736652e+02 -1.14606599e+01 2.50276706e+02 -9.56356207e+00 5.42737846e+00 1.34016887e+02
1716.lowfreq: -8.2128 -7.2541 -0.0009 0.0011 0.0016 5.9920 26.4398 38.1498 43.9814
frequency: 26.3570 38.1065 43.9054 60.8299 74.5889 87.0566 120.3425 140.2000 152.3716 178.3094 185.3759 187.4470 203.1345 242.3975 251.3456 262.2673 271.3665 283.2757 326.1735 345.9223 386.5819 401.1893 426.0283 451.3176 481.9590 544.3095 559.5989 570.0302 577.2723 611.9831 619.4525 629.8088 682.5966 697.8484 734.7919 756.0538 772.6750 783.9843 818.3049 825.1852 853.6098 866.3969 868.7834 899.3058 920.1434 936.2840 951.7343 970.2798 982.8467 985.9663 991.9274 992.9947 1002.2020 1013.0166 1029.7285 1045.5209 1089.0081 1112.6624 1147.4269 1161.1246 1171.1967 1175.3551 1196.9520 1213.2389 1218.4358 1252.7056 1296.3817 1315.0384 1329.0943 1376.7972 1393.4694 1407.0592 1410.2741 1420.4901 1427.7693 1451.7248 1467.2583 1481.7851 1497.0899 1585.9561 1589.0355 1610.8055 1615.1585 3006.8885 3093.6830 3124.4721 3132.6563 3138.8201 3147.4000 3155.1433 3156.5403 3163.7159 3172.5910 3181.5023 3183.5878 3185.5859
redmass: 4.5354 6.0520 5.5486 6.7893 5.1532 7.5705 11.7917 5.7384 4.8150 1.3594 3.2537 5.5171 6.8443 5.3475 5.4473 5.7473 6.5484 6.0255 7.3337 8.9637 10.9238 2.8072 3.4417 4.2089 6.5501 6.9202 4.8198 8.1407 3.9014 6.6524 7.0751 6.4521 7.6912 1.6468 6.1978 1.7654 2.2755 1.9741 5.6077 12.4062 1.2647 5.4871 1.5107 5.9438 2.9290 1.4637 1.3728 7.0278 1.4597 1.3147 4.1350 1.3783 1.3411 2.0688 2.1820 1.8835 1.6341 1.6903 1.9661 1.2285 1.4224 1.0968 1.1189 2.7030 2.3958 3.5701 1.5591 1.1289 1.4263 3.9571 5.4092 2.1307 1.0797 1.0595 2.7598 2.0053 2.9647 2.5601 6.7315 7.0018 5.8990 5.9528 7.5647 1.0256 1.0879 1.0865 1.0886 1.0864 1.0936 1.0912 1.1076 1.0994 1.0976 1.1081 1.0963 1.0970
irintensity: 0.4295 1.8942 2.5799 1.1498 1.6390 1.0917 4.0204 4.1063 4.9100 0.6524 0.5341 3.3008 4.7962 3.0165 1.6082 8.9427 2.2682 1.3826 29.0393 15.2075 104.4911 0.5715 37.4541 8.6635 7.0009 32.0364 27.9743 64.7967 21.2656 1.7668 12.9871 13.5151 14.7656 72.4584 9.5598 61.5135 33.1404 25.1673 35.1206 69.7637 0.5557 21.8283 3.7238 27.0503 37.5528 4.0217 3.3532 10.7771 1.6368 0.3222 10.6932 68.1239 1.2325 20.4629 2.3483 64.8639 7.9116 12.4970 74.3050 2.2582 44.1853 10.0003 19.1849 4.8585 74.4812 36.4686 6.8270 9.5772 14.0990 14.0561 28.6970 0.7458 8.3888 10.1312 23.8100 23.3903 5.2876 10.2590 16.9375 24.4668 3.0705 9.7724 3.4539 20.9655 9.5689 1.9247 3.1454 4.2818 25.7173 14.7631 23.9489 29.3649 13.3481 0.1185 10.7680 9.2597
temp: 298.150 k
press: 1.00000 atm
elementType: 17 16 8 8 7 7 6 6 6 6 6 6 6 6 6 6 6 6 6 6 6 1 1 1 1 1 1 1 1 1 1 1 1 1
symmnumber: 1
zpe: 648246.6 jmol-1
zpe.correction: 0.246904 hartree
zpe.thermalcorrener: 0.266445 hartree
zpe.thermalcorrenthalpy: 0.267389 hartree
zpe.thermalcorrgfe: 0.197544 hartree
zpe.sumelectzpe: -1695.814043 hartree
zpe.sumelectthermal: -1695.794503 hartree
zpe.sumelectthermalent: -1695.793558 hartree
zpe.sumelectthermalfe: -1695.863403 hartree
dipole: -1.1420 0.5383 1.8401
dipole: 2.2316
quadrupole: -119.0269 -126.8785 -145.5338
quadrupole: 1.0661 -13.9420 -6.1252
quadrupole: 11.4529 3.6012 -15.0541 1.0661 -13.9420 -6.1252
hfenergy: -1696.0609475 hartree
pointgroup: C01 [X(C15H13Cl1N2O2S1)]
dipole: -0.4796543 0.1944989 0.7091721 debye
polarizability: 314.8163601|-1.6686231|248.1105834|-9.7259052|-5.5247622|134.1033011 unknown
InChI: InChI=1S/C15H13ClN2O2S/c1-21(19,20)18-13-10-6-5-9-12(13)17-15(18)14(16)11-7-3-2-4-8-11/h2-10,14H,1H3
charge 0 multiplicity 1
34 atoms
Cl 1.527199 -1.289447 2.091643
S  -1.324038 -2.727561 -0.264279
O  -2.73414 -3.018467 -0.998375
O  0.059371 -3.282846 -0.89155
N  -1.14428 -0.831718 -0.101425
N  -0.263297 1.251595 0.134714
C  0.040181 -0.053244 0.060078
C  -2.248356 0.052605 -0.150504
C  1.387528 -0.672422 0.166636
C  -1.663358 1.353516 0.007946
C  2.608282 0.13361 -0.150363
C  -3.639421 -0.129335 -0.315967
C  -2.475077 2.510743 0.019485
C  -1.451221 -3.228419 1.570136
C  -4.430549 1.038304 -0.29757
C  -3.8634 2.336944 -0.13101
C  3.689463 -0.542855 -0.778957
C  2.747244 1.509582 0.176521
C  4.883997 0.140569 -1.086928
C  3.944898 2.187959 -0.128774
C  5.015222 1.510046 -0.75966
H  1.406665 -1.656074 -0.323897
H  -4.081642 -1.114174 -0.481476
H  -2.02315 3.499542 0.141635
H  -1.522338 -4.32554 1.563279
H  -0.531323 -2.849525 2.041811
H  -2.361861 -2.743831 1.947987
H  -5.514485 0.943561 -0.424654
H  -4.523072 3.210881 -0.126859
H  3.590166 -1.606956 -1.025692
H  1.912216 2.033642 0.646899
H  5.70725 -0.390587 -1.576556
H  4.045505 3.249058 0.124573
H  5.94322 2.043943 -0.99335
