program: Gaussian 09
title: 000265707
version: EM64L-G09RevD.01
frameworkgroup: C1[X(C23H18N2O3)]
method: RPBEPBE
basis: SDD
operation: Freq
keyword: #p
keyword: freq=noraman
keyword: PBEPBE/SDD
title: #p freq=noraman PBEPBE/SDD
converged: YES YES NO NO
title: Mulliken charges:
elementType: O O O N N C C C C C C C C C C C C C C C C C C C C C C C H H H H H H H H H H H H H H H H H H
charge: -0.270599 -0.239480 -0.266528 0.057885 -0.012623 0.022313 -0.032399 -0.047501 0.441667 0.232292 0.141721 0.058911 -0.368355 -0.378450 0.059108 -0.367655 -0.373845 -0.255381 -0.354717 -0.361330 -0.213834 -0.528346 0.319120 -0.335849 -0.337748 -0.221877 -0.217507 -0.538082 0.247660 0.261501 0.276544 0.263866 0.231401 0.247904 0.236828 0.232325 0.241281 0.223324 0.239019 0.266740 0.263375 0.236639 0.235838 0.219994 0.243520 0.221333
chargesum: 0.00000
title: Mulliken charges with hydrogens summed into heavy atoms:
elementType: O O O N N C C C C C C C C C C C C C C C C C C C C C C C
charge: -0.270599 -0.239480 -0.266528 0.057885 -0.012623 0.022313 -0.032399 -0.047501 0.441667 0.232292 0.141721 0.058911 -0.120696 -0.116950 0.059108 -0.091111 -0.109979 -0.023981 -0.106813 -0.124502 0.018491 0.175279 0.319120 -0.069108 -0.074373 0.014761 0.018330 0.146765
polarizability: 3.41362961e+02 2.01784430e+01 3.81877071e+02 2.29416738e+01 1.11030915e+01 1.74423800e+02
1716.lowfreq: -9.2137 -0.0009 -0.0003 0.0003 2.9897 5.7841 22.2563 29.5286 31.3903
frequency: 21.9772 29.4998 31.3601 52.6113 69.6716 89.7940 94.7519 120.5551 138.1417 146.2877 166.3495 180.8349 193.2212 200.8062 225.6289 241.0831 263.9563 290.1689 297.5041 324.6753 330.9791 339.4946 355.4068 374.2052 414.3763 425.8035 454.5354 477.6763 487.4632 490.2023 501.1246 522.4748 542.7208 556.4110 564.8110 574.6149 586.5599 602.9183 614.2707 629.2889 641.2374 683.0425 722.0814 732.4270 755.9463 759.0055 769.3106 773.1313 778.4067 813.0854 817.4793 830.9086 837.7138 857.7638 878.1021 887.7698 896.8675 918.7610 925.3712 956.9466 966.3587 967.1853 972.2448 988.7899 993.2380 999.1939 1000.0544 1007.9139 1014.3377 1032.4534 1036.1698 1098.7634 1109.3104 1112.0253 1116.1449 1116.7966 1152.7555 1153.3278 1155.8375 1163.3894 1168.4355 1176.9108 1207.7809 1219.7219 1227.5584 1236.5083 1260.7932 1278.4068 1296.5561 1299.0043 1332.0618 1352.7842 1378.5415 1391.7324 1405.2840 1414.7569 1431.2475 1435.4232 1446.3770 1449.0373 1465.6067 1466.5453 1469.6612 1472.4439 1473.1906 1484.3978 1500.6826 1512.3847 1544.9487 1580.2352 1587.8957 1611.4714 1620.2002 1623.5292 2958.3383 2968.1953 3045.5067 3062.4319 3119.3880 3123.4853 3136.2842 3136.3376 3149.8251 3150.8058 3151.9956 3153.9410 3164.1988 3166.8970 3172.1648 3174.0064 3175.7775 3185.2371
redmass: 4.8684 4.0722 5.1382 5.0643 3.9250 2.8575 3.7054 4.3025 4.9678 3.5300 3.3381 2.8463 4.1280 2.0464 3.4024 1.2053 5.8374 4.6580 5.4326 5.8289 4.7885 4.9294 5.8005 6.0973 2.9582 4.3818 4.4585 4.3564 3.8536 6.0053 4.0887 4.2138 5.2292 5.5725 3.9043 5.2266 6.6156 8.6692 6.7499 7.0635 6.9521 7.3314 4.5489 4.0006 3.4820 5.0129 2.8784 1.7150 1.4148 1.5230 2.9672 1.6697 5.9347 5.4390 1.5329 1.7181 7.6029 4.2275 7.7873 1.6236 1.3624 1.3559 1.3603 8.5233 1.3279 1.3285 3.9836 2.2719 3.0994 2.3778 5.0818 2.0896 1.2786 1.2603 1.4124 1.5220 1.6615 1.3640 1.3277 1.2704 1.5010 1.3112 2.6804 2.6057 2.6413 2.5730 3.6199 2.2401 2.6496 1.2881 4.1474 2.9912 5.8624 8.1762 5.9941 4.0702 1.1377 1.1720 2.7079 2.9203 1.0528 1.0504 3.3496 1.0668 1.0745 3.6002 2.5543 9.9403 6.9753 7.3242 7.5392 6.5794 6.9503 6.5427 1.0329 1.0327 1.1038 1.1023 1.1007 1.0993 1.0861 1.0860 1.0894 1.0877 1.0901 1.0887 1.0958 1.0949 1.0966 1.1006 1.0997 1.0952
irintensity: 0.6888 1.2310 0.2383 1.2043 1.7490 1.2103 3.5442 0.6305 0.8728 0.8407 3.8774 4.0923 2.2641 1.5751 2.2622 0.3892 0.5350 4.4831 1.8826 4.9575 1.0905 2.3318 1.4935 1.2705 0.3586 0.2629 2.3101 1.8863 0.6821 8.3381 10.4639 8.3236 10.8270 1.8377 4.3194 14.4212 15.1833 0.8468 6.1260 4.1064 5.4966 3.1964 0.5004 0.4878 28.2840 13.2955 3.8421 6.0242 133.5830 21.3596 12.5555 71.7988 5.2411 73.4818 1.1097 0.2334 78.2058 9.7489 102.4673 1.6389 2.4393 1.6565 2.2378 48.3265 0.5326 0.0853 26.4082 4.1594 38.3804 34.1717 97.7023 37.1524 2.1899 0.2037 3.6344 4.1844 25.6150 5.2783 3.8148 13.9731 28.6625 119.8293 48.5796 41.6513 97.6379 120.9489 20.8655 20.0407 1.7559 1.0507 3.2323 81.4167 12.8973 11.9114 13.7638 4.7969 0.7343 9.6283 24.6499 67.0400 9.6547 12.3735 24.8459 22.7864 58.6099 23.5271 104.6976 95.8965 5.4902 23.4632 20.0086 40.0461 35.4487 87.5838 75.1328 45.9376 47.1301 33.2826 22.8295 29.7070 2.7258 2.9393 6.5008 7.7557 10.6609 12.8176 12.0774 9.2530 8.3991 34.3725 22.8175 2.1977
temp: 298.150 k
press: 1.00000 atm
elementType: 8 8 8 7 7 6 6 6 6 6 6 6 6 6 6 6 6 6 6 6 6 6 6 6 6 6 6 6 1 1 1 1 1 1 1 1 1 1 1 1 1 1 1 1 1 1
symmnumber: 1
zpe: 923713.2 jmol-1
zpe.correction: 0.351824 hartree
zpe.thermalcorrener: 0.374751 hartree
zpe.thermalcorrenthalpy: 0.375695 hartree
zpe.thermalcorrgfe: 0.298796 hartree
zpe.sumelectzpe: -1220.463543 hartree
zpe.sumelectthermal: -1220.440615 hartree
zpe.sumelectthermalent: -1220.439671 hartree
zpe.sumelectthermalfe: -1220.516571 hartree
dipole: -1.0313 2.2389 1.1989
dipole: 2.7411
quadrupole: -138.6769 -140.0517 -160.9671
quadrupole: 8.8748 5.3536 1.7857
quadrupole: 7.8884 6.5135 -14.4019 8.8748 5.3536 1.7857
hfenergy: -1220.8153666 hartree
pointgroup: C01 [X(C23H18N2O3)]
dipole: 0.8196315 0.5861735 -0.384192 debye
polarizability: 333.1283838|7.2804019|390.9481287|20.4916975|1.1451988|173.5873195 unknown
InChI: InChI=1S/C23H18N2O3/c1-26-16-13-11-15(12-14-16)23(27-2)22-21(17-7-3-6-10-20(17)28-23)24-18-8-4-5-9-19(18)25-22/h3-14H,1-2H3
charge 0 multiplicity 1
46 atoms
O  -1.139946 -1.948206 -0.469204
O  -0.872888 -0.412046 -2.297711
O  -5.144086 2.604394 1.331014
N  0.755125 1.248165 -0.324719
N  2.743923 -0.607407 0.594898
C  -0.840206 -0.530784 -0.85109
C  0.527543 -0.075147 -0.295935
C  1.523828 -1.022501 0.167128
C  -2.00216 0.29729 -0.318496
C  1.202629 -2.451984 0.170809
C  -0.119521 -2.857382 -0.160126
C  1.990935 1.6932 0.117003
C  -2.610582 -0.038554 0.916678
C  -2.447932 1.437454 -1.018915
C  2.995295 0.751938 0.578468
C  2.156471 -3.446994 0.51723
C  -0.489067 -4.221797 -0.135571
C  1.80047 -4.806257 0.536628
C  -3.651868 0.748465 1.438008
C  -3.496267 2.234597 -0.510396
C  0.471543 -5.191257 0.211829
C  0.176452 -1.134413 -3.036485
C  -4.098763 1.888719 0.72471
C  2.277596 3.092309 0.116177
C  4.262327 1.244298 1.024019
C  3.522959 3.546027 0.5588
C  4.51754 2.617797 1.013338
C  -5.649435 3.786297 0.629877
H  -2.280468 -0.929391 1.459429
H  -1.97249 1.695202 -1.968108
H  3.167258 -3.114715 0.772817
H  -1.518556 -4.492566 -0.387278
H  2.541857 -5.565946 0.8041
H  -4.136676 0.499018 2.386592
H  -3.828222 3.110329 -1.075725
H  0.187384 -6.249187 0.229059
H  0.095286 -2.224777 -2.876006
H  1.190679 -0.787713 -2.758463
H  -0.011866 -0.901848 -4.095237
H  1.498178 3.776004 -0.233916
H  5.004927 0.51805 1.368447
H  3.746996 4.618097 0.562363
H  5.486553 2.996199 1.356748
H  -4.858081 4.551427 0.506532
H  -6.450042 4.181256 1.272556
H  -6.064238 3.519942 -0.361977
