program: Gaussian 09
title: 000265609
version: EM64L-G09RevD.01
frameworkgroup: C1[X(C11H16N4O2)]
method: RPBEPBE
basis: SDD
operation: Freq
keyword: #p
keyword: freq=noraman
keyword: PBEPBE/SDD
title: #p freq=noraman PBEPBE/SDD
converged: NO YES NO NO
title: Mulliken charges:
elementType: O O N N N N C C C C C C C C C C C H H H H H H H H H H H H H H H H
charge: -0.279171 -0.270185 -0.181634 -0.165946 -0.096742 -0.222648 0.105947 0.230508 0.080406 -0.475173 0.144145 -0.346228 0.196125 -0.627697 -0.616287 -0.602588 -0.694342 0.224659 0.224695 0.220755 0.220745 0.237974 0.262667 0.262577 0.270913 0.245370 0.245371 0.267550 0.249323 0.249335 0.206482 0.206472 0.226623
chargesum: 0.00000
title: Mulliken charges with hydrogens summed into heavy atoms:
elementType: O O N N N N C C C C C C C C C C C
charge: -0.279171 -0.270185 -0.181634 -0.165946 -0.096742 -0.222648 0.105947 0.230508 0.080406 -0.025819 0.144145 0.095272 0.196125 0.135521 0.145366 0.163620 -0.054766
polarizability: 2.13517147e+02 9.26837063e-01 1.68618570e+02 2.80087546e-03 1.92489442e-03 8.75743882e+01
1716.lowfreq: -112.2714 -5.5225 -0.0003 0.0004 0.0007 5.0964 5.9080 42.6476 65.3468
frequency: -112.2631 42.2651 65.2670 75.8670 87.1308 91.3720 101.0951 126.7480 130.6468 136.6075 208.2770 230.1323 234.7480 235.9586 265.9357 282.1175 311.3471 316.4784 353.3206 380.5232 386.2249 417.9144 447.7228 491.6894 557.0059 625.1414 626.4148 672.7665 704.1016 719.2134 742.9004 743.8969 758.9081 806.7413 872.3917 903.6910 946.9580 959.0710 1023.6814 1050.9785 1055.0394 1092.1799 1103.1845 1124.7352 1129.8460 1131.9859 1142.8122 1190.7310 1210.3141 1225.7607 1227.4624 1259.4448 1282.7445 1289.4629 1297.7153 1341.4847 1358.3821 1393.7121 1399.1964 1415.5201 1427.8099 1441.1853 1460.5488 1462.4107 1462.7783 1472.1624 1475.1473 1475.4843 1477.9739 1479.5313 1480.8721 1486.0283 1486.3550 1508.3174 1574.0611 1614.8295 1651.0853 2953.1300 2972.3284 2993.8554 3006.8753 3010.8467 3012.8505 3014.3857 3049.5935 3077.0556 3081.3816 3095.7204 3102.0148 3105.9279 3129.2715 3137.1933 3137.7185
redmass: 1.0307 3.5189 1.6354 1.0846 3.4576 3.7875 3.6560 1.5488 2.6772 2.1596 3.6065 1.6069 4.3373 2.0573 3.7513 2.8054 5.2059 2.8948 3.5045 7.1366 9.3381 7.4806 6.5114 5.5235 6.9722 4.6576 5.1412 7.4096 10.8780 6.7917 3.2990 1.5543 4.6200 5.2402 1.2809 1.9591 2.9562 4.7880 2.8812 3.0806 2.5504 2.0936 1.4851 1.3192 1.3011 1.3001 2.2565 3.5018 4.8037 1.3044 2.6244 3.4748 2.0339 1.0820 6.7232 2.5249 2.2718 1.3772 1.9657 1.3440 1.2626 2.1565 1.4047 1.0414 1.4825 1.0600 1.3290 1.0445 1.0428 1.1408 1.0424 1.0820 1.3253 2.2719 8.2623 10.6811 10.4810 1.0592 1.0363 1.0987 1.0335 1.0329 1.0612 1.0334 1.0999 1.0984 1.1029 1.1024 1.1021 1.1020 1.1021 1.1022 1.1012
irintensity: 0.1286 0.2053 0.1737 0.0808 0.5497 0.0182 0.0257 0.4502 16.5702 0.8545 12.1535 0.5544 2.6438 0.0107 0.0618 0.8332 1.1137 2.1863 9.3291 0.7920 22.7330 0.2990 14.5106 22.1885 2.6005 3.2925 1.0716 1.5025 6.7251 3.8307 23.3666 0.6672 0.6002 0.2397 0.0065 8.9093 1.1853 40.1541 61.2067 13.9437 4.2927 1.4987 0.2494 0.6329 0.3024 0.1002 11.2317 56.3657 29.1680 0.2199 4.5984 20.1076 24.5887 0.4566 47.7499 14.8694 3.5529 3.3862 56.9373 14.6441 49.3477 189.7816 76.3978 11.5568 1.8406 9.5596 39.1830 18.9694 15.4244 1.5541 13.8643 5.7483 89.9386 62.2709 12.3441 571.4193 456.6039 20.3760 41.8475 12.2878 36.7314 29.8516 15.6552 28.0092 4.4981 42.4256 66.7398 18.7861 18.1534 10.3684 10.5451 0.8521 0.5065
temp: 298.150 k
press: 1.00000 atm
elementType: 8 8 7 7 7 7 6 6 6 6 6 6 6 6 6 6 6 1 1 1 1 1 1 1 1 1 1 1 1 1 1 1 1
symmnumber: 1
zpe: 700543.3 jmol-1
zpe.correction: 0.266823 hartree
zpe.thermalcorrener: 0.283804 hartree
zpe.thermalcorrenthalpy: 0.284749 hartree
zpe.thermalcorrgfe: 0.221893 hartree
zpe.sumelectzpe: -796.992964 hartree
zpe.sumelectthermal: -796.975983 hartree
zpe.sumelectthermalent: -796.975039 hartree
zpe.sumelectthermalfe: -797.037894 hartree
dipole: 4.8043 1.1767 0.0001
dipole: 4.9463
quadrupole: -102.1473 -103.4278 -99.8043
quadrupole: 2.7234 -0.0001 0.0011
quadrupole: -0.3542 -1.6347 1.9888 2.7234 -0.0001 0.0011
hfenergy: -797.2597871 hartree
pointgroup: C01 [X(C11H16N4O2)]
dipole: 1.8933684 0.4496103 -0.0020752 debye
polarizability: 213.5278835|0.609701|168.6076902|-0.1189338|-0.0503349|87.574531 unknown
InChI: InChI=1S/C11H16N4O2/c1-5-6-7-12-9-8(13(7)2)10(16)15(4)11(17)14(9)3/h5-6H2,1-4H3
charge 0 multiplicity 1
33 atoms
O  -1.874272 2.607342 -0.000401
O  -3.492385 -1.826505 0.004073
N  0.976712 1.314195 -0.002121
N  -1.162447 -1.534687 0.001763
N  1.242735 -0.95446 -0.000657
N  -2.65659 0.363753 0.001889
C  -0.312358 0.75071 -0.000351
C  1.881794 0.254131 -0.002214
C  -0.105854 -0.636787 0.000282
C  3.376012 0.431335 -0.003762
C  -1.613117 1.362861 0.000594
C  4.143851 -0.910536 -0.003948
C  -2.493304 -1.051372 0.002472
C  1.273312 2.755184 -0.003298
C  -0.912495 -2.988129 0.002528
C  -4.059925 0.836698 0.00273
C  5.67078 -0.69557 -0.005767
H  3.681351 1.026127 -0.890384
H  3.683089 1.026854 0.881771
H  3.838413 -1.501296 0.878674
H  3.836446 -1.502193 -0.885291
H  2.364095 2.899751 -0.005584
H  0.835138 3.234717 -0.89339
H  0.838801 3.235483 0.888192
H  -1.889571 -3.49274 0.003629
H  -0.334576 -3.272721 0.897746
H  -0.335997 -3.273899 -0.893232
H  -4.034302 1.936141 0.001551
H  -4.585428 0.462187 0.896443
H  -4.587113 0.460181 -0.889132
H  5.998337 -0.131958 -0.900352
H  6.000277 -0.130641 0.887279
H  6.204889 -1.662756 -0.005631
