program: Gaussian 09
title: 000265614
version: EM64L-G09RevD.01
frameworkgroup: C1[X(C15H22N4O2)]
method: RPBEPBE
basis: SDD
operation: Freq
keyword: #p
keyword: freq=noraman
keyword: PBEPBE/SDD
title: #p freq=noraman PBEPBE/SDD
converged: YES YES NO NO
title: Mulliken charges:
elementType: O O N N N N C C C C C C C C C C C C C C C H H H H H H H H H H H H H H H H H H H H H H
charge: -0.290373 -0.270225 -0.189640 -0.079153 -0.165721 -0.220165 0.029090 -0.485806 -0.491447 -0.430109 -0.429054 -0.456624 -0.501458 0.187659 0.137328 0.083044 -0.652330 0.132859 0.196871 -0.616664 -0.602119 0.211869 0.190523 0.225658 0.229162 0.195522 0.216343 0.208748 0.206719 0.220161 0.196092 0.236975 0.243086 0.225528 0.236363 0.237469 0.303990 0.270660 0.245792 0.245997 0.268091 0.249655 0.249635
chargesum: 0.00000
title: Mulliken charges with hydrogens summed into heavy atoms:
elementType: O O N N N N C C C C C C C C C C C C C C C
charge: -0.290373 -0.270225 -0.189640 -0.079153 -0.165721 -0.220165 0.240959 -0.069625 -0.066763 -0.005018 -0.002173 -0.023557 -0.032844 0.187659 0.137328 0.083044 0.125492 0.132859 0.196871 0.145785 0.165262
polarizability: 2.76609547e+02 2.07982851e+00 1.94366171e+02 -1.33708049e+01 1.94015834e+00 1.28544229e+02
1716.lowfreq: -24.3561 -2.4032 -0.0002 0.0004 0.0008 5.0062 8.0393 25.3567 33.0042
frequency: -24.0729 25.2048 32.0045 42.7121 66.0839 77.5176 85.9169 96.3187 113.0955 120.5576 127.3384 140.5576 150.5994 189.9314 203.1711 237.0236 241.3701 271.2616 296.2155 308.7250 350.9810 354.2885 385.9066 390.7826 413.3897 425.1977 437.8640 489.7439 520.6719 563.0613 618.6961 625.0947 654.2459 692.9765 704.3020 722.3933 743.4464 747.0428 764.6457 776.1374 796.3525 810.9489 862.4734 889.8696 926.7231 942.2874 956.7256 960.6513 968.0263 1000.4388 1016.2412 1029.8123 1052.9614 1058.2424 1082.9630 1111.9272 1116.9285 1125.9519 1130.3240 1132.0085 1167.0392 1177.5588 1189.3369 1193.9299 1212.6059 1220.4860 1226.2087 1229.5930 1257.6091 1261.2167 1272.8688 1280.4581 1293.4937 1299.9005 1300.3893 1302.2089 1314.0866 1336.6137 1349.5271 1361.0688 1392.0059 1413.3630 1426.6437 1437.7824 1454.1985 1461.3440 1462.7279 1469.3130 1471.7219 1474.0838 1474.2922 1476.7794 1477.1308 1480.9796 1488.3080 1490.6800 1494.3262 1505.0418 1572.1339 1613.7002 1646.7907 2947.1121 2964.7204 2967.9044 2979.1767 2993.1438 2994.7813 2998.6017 3007.1059 3010.9373 3012.2567 3027.1112 3038.2979 3051.6285 3055.7042 3071.7022 3078.0190 3085.2938 3096.0077 3103.8712 3112.4758 3138.4511 3138.8659
redmass: 1.6084 4.1525 4.3708 2.7661 1.0361 2.4041 3.2713 2.8837 2.0947 2.9417 1.2697 2.3385 2.7205 2.1019 3.3140 5.8162 4.7159 2.4493 3.2131 4.0207 3.9301 3.7760 7.4498 4.4827 6.1063 5.0716 2.5731 5.2175 5.3649 3.2745 2.7349 4.2648 9.2174 7.4383 10.6148 5.1354 11.0015 1.5813 1.4336 2.9090 3.4373 1.6631 3.1912 2.4778 1.7185 2.8976 2.0434 3.9464 1.4372 1.8547 2.6427 2.7617 3.0283 2.9751 1.7342 2.6085 1.6671 1.3179 1.2974 1.3051 1.8288 1.4707 1.4163 3.1200 3.1726 1.3965 1.8953 1.9866 1.2161 1.9554 2.0609 1.3408 1.2510 2.8073 1.6104 1.4359 1.4123 1.4062 1.6451 3.1943 2.3724 1.3453 1.2611 1.9226 1.3438 1.1059 1.2417 1.2406 1.0845 1.0435 1.1093 1.0543 1.2188 1.1828 1.4630 1.1000 1.0661 2.6343 7.8298 10.6395 9.7105 1.0811 1.0625 1.0637 1.0637 1.0339 1.0612 1.0625 1.0336 1.0655 1.0328 1.0974 1.0975 1.0984 1.1032 1.1012 1.1047 1.1020 1.1024 1.1021 1.1027 1.1024 1.1012
irintensity: 0.0046 0.2096 0.1878 0.0197 0.2055 1.1704 0.0331 0.1400 3.2491 2.1972 1.4421 6.2641 4.0687 1.8847 7.2061 1.9228 0.4437 2.8518 1.1559 1.6707 6.4939 5.8645 21.9759 3.6208 3.9614 9.5182 1.6784 22.5677 4.0129 1.4201 0.6153 2.5486 1.6773 2.3131 6.9805 4.8594 13.3054 2.2031 5.1855 0.9882 0.9369 1.3462 1.7690 6.8904 0.4310 3.8620 12.8934 34.2300 0.3054 13.2325 6.9795 77.6820 10.9974 0.4279 1.9755 2.3026 10.2250 1.0146 0.3842 0.0136 5.4374 1.8833 9.7586 49.7702 28.3755 1.8928 4.2939 1.1755 3.4149 10.2942 36.6753 8.2443 1.3063 35.1335 7.4906 1.6337 0.5559 3.2611 0.9217 9.4824 19.3474 8.0536 48.1914 213.1434 94.8291 2.5805 1.8621 21.6462 8.2467 18.6912 10.7711 15.4949 27.7278 2.0604 96.8261 4.0809 31.1950 86.5907 5.7280 600.0478 440.2837 4.9382 11.0469 30.8260 71.2541 46.9527 33.4118 26.2138 34.9931 65.9852 27.2004 18.5304 39.7767 12.6024 13.3186 15.7630 109.7771 19.8764 18.3363 17.9754 1.1018 0.8307 0.5829
temp: 298.150 k
press: 1.00000 atm
elementType: 8 8 7 7 7 7 6 6 6 6 6 6 6 6 6 6 6 6 6 6 6 1 1 1 1 1 1 1 1 1 1 1 1 1 1 1 1 1 1 1 1 1 1
symmnumber: 1
zpe: 941945.8 jmol-1
zpe.correction: 0.358768 hartree
zpe.thermalcorrener: 0.379259 hartree
zpe.thermalcorrenthalpy: 0.380203 hartree
zpe.thermalcorrgfe: 0.307972 hartree
zpe.sumelectzpe: -952.709137 hartree
zpe.sumelectthermal: -952.688646 hartree
zpe.sumelectthermalent: -952.687702 hartree
zpe.sumelectthermalfe: -952.759933 hartree
dipole: 5.2576 0.3324 -0.7077
dipole: 5.3155
quadrupole: -135.8789 -129.2346 -124.5529
quadrupole: 0.5207 0.8742 -0.8321
quadrupole: -5.9901 0.6542 5.3359 0.5207 0.8742 -0.8321
hfenergy: -953.0679047 hartree
pointgroup: C01 [X(C15H22N4O2)]
dipole: 2.0667102 -0.1339801 0.2900649 debye
polarizability: 276.437322|-2.242055|194.3300455|14.2660859|2.4822535|128.7525796 unknown
InChI: InChI=1S/C15H22N4O2/c1-17-11(9-8-10-6-4-5-7-10)16-13-12(17)14(20)19(3)15(21)18(13)2/h10H,4-9H2,1-3H3
charge 0 multiplicity 1
43 atoms
O  -2.745818 -2.706116 -0.318889
O  -5.116908 1.371024 -0.386995
N  -0.237669 -0.963562 0.38019
N  -0.399377 1.307612 0.578126
N  -2.8215 1.473335 0.09432
N  -3.908679 -0.638236 -0.345843
C  4.278127 0.533251 -0.07925
C  4.940372 -0.657407 0.667527
C  5.151311 0.646018 -1.357014
C  6.470514 -0.483184 0.426905
C  6.605093 0.401469 -0.862717
C  2.773234 0.366024 -0.372545
C  1.906427 0.309029 0.920483
C  0.436414 0.22655 0.641511
C  -1.581304 -0.626634 0.137223
C  -1.637799 0.770568 0.265907
C  0.316264 -2.329674 0.38861
C  -2.723476 -1.439954 -0.182869
C  -4.012374 0.778143 -0.221281
C  -2.847858 2.941129 0.241361
C  -5.171977 -1.336204 -0.678057
H  4.421249 1.454825 0.526344
H  4.584957 -1.604663 0.211351
H  4.688626 -0.693413 1.74294
H  5.032195 1.616305 -1.872331
H  4.84859 -0.146809 -2.071181
H  6.942784 0.020503 1.290203
H  6.97338 -1.4601 0.312764
H  7.225344 -0.083485 -1.637328
H  7.091646 1.363475 -0.617009
H  2.621561 -0.555985 -0.971353
H  2.415128 1.210829 -0.992626
H  2.079608 1.227561 1.508431
H  2.225282 -0.548768 1.542763
H  1.142312 -2.416591 -0.33735
H  0.689604 -2.590252 1.394617
H  -0.4904 -3.02574 0.110878
H  -3.879071 3.27502 0.056472
H  -2.159157 3.406003 -0.483772
H  -2.531005 3.225243 1.258868
H  -4.944337 -2.410005 -0.744838
H  -5.56937 -0.963369 -1.636172
H  -5.92534 -1.147466 0.104125
