program: Gaussian 09
title: 000265608
version: EM64L-G09RevD.01
frameworkgroup: C1[X(C12H18N4O2)]
method: RPBEPBE
basis: SDD
operation: Freq
keyword: #p
keyword: freq=noraman
keyword: PBEPBE/SDD
title: #p freq=noraman PBEPBE/SDD
converged: YES YES NO NO
title: Mulliken charges:
elementType: O O N N N N C C C C C C C C C C C C H H H H H H H H H H H H H H H H H H
charge: -0.290502 -0.269885 -0.193406 -0.089436 -0.165528 -0.219422 -0.166049 0.253026 0.103386 0.076356 -0.371576 -0.718139 0.141535 -0.668872 0.195620 -0.706747 -0.616825 -0.601802 0.223530 0.205185 0.225896 0.219901 0.214862 0.243063 0.238844 0.304739 0.243978 0.225260 0.200739 0.232504 0.271254 0.245334 0.245682 0.268196 0.249554 0.249743
chargesum: 0.00000
title: Mulliken charges with hydrogens summed into heavy atoms:
elementType: O O N N N N C C C C C C C C C C C C
charge: -0.290502 -0.269885 -0.193406 -0.089436 -0.165528 -0.219422 0.057481 0.253026 0.103386 0.076356 0.059506 -0.040313 0.141535 0.118689 0.195620 -0.048244 0.145445 0.165692
polarizability: 2.22689822e+02 -1.94149368e+00 1.72727605e+02 -6.65511972e+00 -1.16989368e+00 1.07938791e+02
1716.lowfreq: -7.3196 -5.3705 -1.1457 0.0002 0.0004 0.0008 23.4923 45.1372 78.9871
frequency: 23.4354 45.1133 78.9757 85.4868 89.3580 101.5377 112.2860 125.8444 127.2212 149.2926 163.8157 208.9702 217.4655 232.3278 238.7841 246.3558 271.6452 293.6552 308.0730 348.4606 354.5644 387.8714 400.9740 412.3223 447.2469 461.5369 489.4705 561.1914 608.0986 652.9912 701.6228 703.2854 723.6654 733.3301 742.1147 778.3132 805.3948 842.9607 935.4200 959.7602 961.6579 1003.6096 1022.2240 1032.8252 1052.1134 1085.5060 1099.0962 1121.4680 1128.4008 1129.2314 1131.4838 1167.5705 1195.6097 1209.7018 1227.7611 1247.8707 1264.5469 1277.8931 1301.4738 1306.8652 1326.7105 1374.7337 1383.0726 1390.2374 1395.0716 1413.0855 1425.9426 1434.4375 1456.1682 1462.9755 1470.4886 1472.5414 1474.5670 1477.9197 1478.6450 1479.4365 1481.3323 1484.5466 1492.6743 1497.2345 1504.0955 1570.7427 1612.7196 1646.2274 2973.0075 2984.0024 2987.7447 2990.4232 2995.8655 3006.7979 3011.6112 3041.4274 3071.0568 3076.4158 3082.1823 3090.0222 3095.6036 3098.5529 3103.0996 3110.8639 3138.4289 3138.9010
redmass: 3.4031 3.5783 1.4495 1.8072 2.3008 1.2218 2.4698 3.5209 2.7583 2.1753 1.3970 3.2035 1.0639 1.7273 4.4009 1.7953 4.1794 2.7070 3.8010 3.6237 4.3869 7.9554 5.0252 6.6443 4.6256 4.5037 5.3469 4.7446 4.4666 10.3123 3.9918 9.1866 6.5781 4.2707 11.3685 3.4619 1.5044 2.1396 2.6793 3.5991 1.4297 1.6204 2.7208 2.8525 3.0799 1.7017 2.2581 1.8371 1.3888 1.3044 1.3005 2.2624 3.3435 4.3607 2.7395 1.5222 3.3323 1.3030 6.2889 2.3471 1.4286 2.6837 1.2545 1.2291 2.1441 1.3314 1.2711 2.4128 1.4496 1.1883 1.0513 1.0441 1.2293 1.0431 1.0806 1.0848 1.0732 1.0674 1.4427 1.0497 2.4655 7.7422 10.5963 9.6672 1.0363 1.0528 1.0469 1.0703 1.0413 1.0335 1.0328 1.1002 1.1014 1.0989 1.1003 1.1026 1.1024 1.1003 1.1021 1.1027 1.1023 1.1012
irintensity: 0.0189 0.0036 0.1262 0.0283 0.3459 1.2915 0.0305 0.8800 13.6342 0.5960 2.3098 1.2955 0.9171 6.1400 0.8280 4.6953 0.6076 1.0861 0.4311 7.6215 5.3988 22.9175 6.8063 1.3206 3.8751 8.6774 16.9302 2.3544 2.4470 2.2411 6.1308 6.7018 0.8537 3.4704 13.3628 2.5203 7.3969 0.1308 1.8066 41.3355 8.7058 10.0848 65.5319 29.4042 9.6160 11.7614 1.7680 11.1117 3.1425 0.2165 0.1057 13.4790 36.6061 44.0066 3.8064 2.6169 29.1418 5.0774 41.1654 35.0402 6.6038 3.8484 9.8815 14.4280 39.6511 12.7571 48.6061 149.3156 64.0233 9.3081 12.6440 17.3710 39.5490 17.6671 1.2146 21.7168 6.9346 8.6812 91.3912 21.9520 107.6732 6.6526 594.1161 442.0020 25.7787 6.4527 61.2430 9.3264 61.0005 34.7949 29.2526 1.9038 56.9448 46.1639 51.7202 16.4297 18.5039 27.8617 18.0119 1.0715 0.8347 0.5327
temp: 298.150 k
press: 1.00000 atm
elementType: 8 8 7 7 7 7 6 6 6 6 6 6 6 6 6 6 6 6 1 1 1 1 1 1 1 1 1 1 1 1 1 1 1 1 1 1
symmnumber: 1
zpe: 773617.6 jmol-1
zpe.correction: 0.294655 hartree
zpe.thermalcorrener: 0.313776 hartree
zpe.thermalcorrenthalpy: 0.314720 hartree
zpe.thermalcorrgfe: 0.246981 hartree
zpe.sumelectzpe: -836.217716 hartree
zpe.sumelectthermal: -836.198596 hartree
zpe.sumelectthermalent: -836.197652 hartree
zpe.sumelectthermalfe: -836.265391 hartree
dipole: 4.8402 0.5357 -0.3274
dipole: 4.8808
quadrupole: -108.3883 -111.2705 -106.1646
quadrupole: 1.9645 -0.0384 -0.5031
quadrupole: 0.2195 -2.6627 2.4432 1.9645 -0.0384 -0.5031
hfenergy: -836.5123716 hartree
pointgroup: C01 [X(C12H18N4O2)]
dipole: 1.8983759 0.288232 -0.0209075 debye
polarizability: 222.7794404|1.7748284|164.8046632|-6.2078138|21.1826562|115.772114 unknown
InChI: InChI=1S/C12H18N4O2/c1-6-7(2)9-13-10-8(14(9)3)11(17)16(5)12(18)15(10)4/h7H,6H2,1-5H3
charge 0 multiplicity 1
36 atoms
O  -1.765282 2.482831 0.839239
O  -3.709884 -1.632813 -0.393554
N  0.971825 1.140088 0.106044
N  1.058101 -1.016417 -0.641279
N  -1.374956 -1.458829 -0.558857
N  -2.710839 0.399981 0.212755
C  3.288665 0.171919 -0.436232
C  1.78662 0.098779 -0.329494
C  -0.35214 0.664421 0.072276
C  -0.254481 -0.658175 -0.390463
C  3.957495 -0.759542 0.621574
C  3.743839 -0.204624 -1.871029
C  -1.599855 1.294352 0.412015
C  1.377243 2.494361 0.529927
C  -2.65781 -0.944162 -0.258287
C  3.654036 -0.362231 2.081296
C  -1.238593 -2.842297 -1.052816
C  -4.067835 0.907079 0.521068
H  3.605848 1.21269 -0.22417
H  5.051545 -0.741842 0.448884
H  3.614459 -1.794363 0.432334
H  3.318699 0.48244 -2.624372
H  4.845534 -0.163326 -1.946368
H  3.40933 -1.227081 -2.116335
H  1.87714 3.027072 -0.29728
H  0.466832 3.04378 0.816383
H  2.059297 2.440415 1.39514
H  4.144479 -1.054884 2.788611
H  4.020346 0.65804 2.305409
H  2.568026 -0.390246 2.287669
H  -2.247184 -3.277101 -1.105006
H  -0.604509 -3.428252 -0.366559
H  -0.770024 -2.842847 -2.051278
H  -3.958068 1.94464 0.868531
H  -4.535976 0.284143 1.300612
H  -4.700922 0.864397 -0.380189
