program: Gaussian 09
title: 000265612
version: EM64L-G09RevD.01
frameworkgroup: C1[X(C16H26N4O2)]
method: RPBEPBE
basis: SDD
operation: Freq
keyword: #p
keyword: freq=noraman
keyword: PBEPBE/SDD
title: #p freq=noraman PBEPBE/SDD
converged: YES YES NO NO
title: Mulliken charges:
elementType: O O N N N N C C C C C C C C C C C C C C C C H H H H H H H H H H H H H H H H H H H H H H H H H H
charge: -0.290510 -0.269887 -0.188967 -0.082929 -0.165423 -0.220098 -0.391658 -0.363529 -0.503975 -0.385060 0.189892 -0.371528 0.135497 0.085518 -0.353194 0.134477 -0.356473 -0.652414 0.196466 -0.616746 -0.695477 -0.602018 0.231681 0.196121 0.202498 0.192594 0.214558 0.244915 0.192373 0.198916 0.192805 0.188809 0.189823 0.187705 0.195956 0.194400 0.236722 0.237344 0.304347 0.270636 0.245713 0.246265 0.210381 0.216269 0.209722 0.268080 0.249555 0.249850
chargesum: 0.00000
title: Mulliken charges with hydrogens summed into heavy atoms:
elementType: O O N N N N C C C C C C C C C C C C C C C C
charge: -0.290510 -0.269887 -0.188967 -0.082929 -0.165423 -0.220098 0.036144 0.031563 -0.044502 0.006229 0.189892 0.010086 0.135497 0.085518 0.024334 0.134477 0.033883 0.125999 0.196466 0.145868 -0.059105 0.165466
polarizability: 2.92596928e+02 -3.09110731e+00 2.05355381e+02 2.67118921e+01 2.27942632e+00 1.47996310e+02
1716.lowfreq: -11.9934 -2.3066 -0.0007 0.0004 0.0011 4.3036 17.2564 23.1033 39.1229
frequency: 17.0701 22.9754 38.9658 52.9604 62.5673 73.3519 83.7934 86.0589 96.0098 101.0948 107.4480 118.8026 133.2133 136.3742 144.1299 149.3224 160.0537 199.0229 215.9432 231.2452 237.8270 267.6469 282.0264 294.9956 312.8735 341.9582 354.7117 381.4003 390.3638 413.7446 426.9476 447.5938 476.5962 490.9417 535.2846 623.5372 653.9015 693.0818 704.4948 721.7620 722.7987 725.9336 742.7952 743.7074 769.0061 785.6455 798.7384 854.5064 889.6980 930.1323 944.5768 960.5360 981.7539 1003.0253 1011.8206 1029.1561 1038.2578 1053.2737 1056.9359 1076.6176 1079.7596 1082.1311 1119.1128 1125.9844 1129.6628 1132.0479 1161.6125 1186.8633 1194.6221 1211.6319 1214.6529 1224.2119 1228.5197 1254.1350 1255.9739 1269.4518 1280.9396 1283.3105 1292.9679 1294.6899 1296.5919 1300.5237 1322.2665 1342.3587 1355.9167 1357.4402 1360.5292 1391.6999 1392.2017 1413.2195 1426.5327 1436.7637 1453.8946 1461.2887 1462.1259 1465.5193 1466.8003 1471.4547 1473.6080 1475.7299 1477.6525 1477.9675 1478.1648 1480.7467 1484.3982 1488.4534 1489.4035 1493.0551 1504.8569 1572.1826 1613.9153 1646.5186 2951.6092 2952.4230 2955.0755 2961.7220 2969.0979 2972.4776 2973.0901 2985.8517 2989.5403 2993.2547 2993.8026 3005.3874 3006.9230 3011.9320 3020.8952 3034.5808 3043.8450 3069.0072 3070.3889 3071.2934 3085.5213 3095.7092 3103.6059 3112.5120 3138.1850 3138.9291
redmass: 4.5715 4.5340 2.5264 1.8769 3.7088 1.9212 1.7833 1.0653 3.2143 2.1441 1.4714 1.5788 3.3097 2.2550 2.0138 2.1565 3.6601 3.2996 5.2441 1.1309 5.0493 2.4905 4.2028 2.9257 3.6120 4.7098 3.7051 7.2322 7.4005 6.1221 4.4121 4.0928 3.4565 5.3142 5.4827 4.4372 9.8553 7.2146 10.4632 1.2924 2.6933 1.1672 1.2366 7.6702 4.2582 1.5411 2.8302 1.2860 1.8923 1.2789 3.0170 4.8493 4.7494 1.2532 3.6059 2.7470 3.1536 2.9877 2.9760 1.5264 2.1161 2.1454 2.5079 1.3190 1.3029 1.3010 2.1227 1.7930 3.1744 3.1071 1.2784 2.0399 2.2801 1.5158 1.3309 2.7447 1.1664 1.1710 1.3101 1.1268 1.1274 6.1679 1.3699 1.4728 1.6038 1.6798 3.1822 1.2188 2.3945 1.3441 1.2541 1.9081 1.3727 1.0727 1.1265 1.1178 1.2830 1.1050 1.0437 1.1967 1.0613 1.0425 1.0586 1.2298 1.0869 1.3952 1.1601 1.0516 2.6609 7.8159 10.6731 9.6933 1.0589 1.0588 1.0594 1.0594 1.0588 1.0374 1.0609 1.0957 1.0653 1.0346 1.0958 1.1006 1.0336 1.0328 1.1026 1.1026 1.1027 1.1007 1.1007 1.0993 1.1021 1.1024 1.1021 1.1026 1.1023 1.1012
irintensity: 0.2189 0.2807 0.0236 0.0045 0.0372 1.1117 0.0810 0.0442 0.0483 0.0443 1.4772 1.5365 6.8124 2.8016 3.9585 0.5070 0.0580 8.0426 2.5757 0.0102 0.8296 3.0121 0.1858 1.1640 0.8418 6.3495 7.2739 9.0972 16.6681 4.2736 4.2870 5.4913 2.7385 21.6175 0.6901 2.7760 1.6229 1.9418 7.2035 5.7103 15.0462 0.1549 2.2912 13.7333 0.5606 0.9081 0.3097 0.3781 4.9673 1.3775 6.1580 37.6177 2.8739 2.7068 7.2243 74.2328 1.2582 8.9334 0.1993 6.0527 2.1292 0.3372 24.6819 0.8252 0.2612 0.1325 13.0422 0.3974 45.4386 31.9948 11.0045 4.0057 1.8506 1.7171 0.8459 37.5746 10.5176 3.0985 3.7321 0.1027 2.6471 37.5376 1.1965 0.3092 0.4930 0.6210 11.0039 11.5947 19.7240 11.1021 43.0268 203.7147 106.6051 0.0282 0.4958 0.9338 8.9658 9.0876 16.7588 23.0811 7.5445 15.9786 9.9543 2.1902 4.3486 56.8014 63.1525 29.9446 88.4686 6.7502 598.1923 442.0050 0.5172 2.5315 0.5315 28.8493 101.5626 30.9682 68.9637 1.0815 25.5682 58.6400 6.5856 1.9976 34.6894 29.8917 0.8335 19.4231 120.5470 80.2752 51.5192 55.1731 19.3230 18.3489 17.9675 1.1761 0.8326 0.5811
temp: 298.150 k
press: 1.00000 atm
elementType: 8 8 7 7 7 7 6 6 6 6 6 6 6 6 6 6 6 6 6 6 6 6 1 1 1 1 1 1 1 1 1 1 1 1 1 1 1 1 1 1 1 1 1 1 1 1 1 1
symmnumber: 1
zpe: 1067450.1 jmol-1
zpe.correction: 0.406570 hartree
zpe.thermalcorrener: 0.431245 hartree
zpe.thermalcorrenthalpy: 0.432189 hartree
zpe.thermalcorrgfe: 0.349506 hartree
zpe.sumelectzpe: -993.109077 hartree
zpe.sumelectthermal: -993.084403 hartree
zpe.sumelectthermalent: -993.083458 hartree
zpe.sumelectthermalfe: -993.166142 hartree
dipole: 4.9665 -0.6337 1.4868
dipole: 5.2228
quadrupole: -152.8057 -136.8451 -132.9042
quadrupole: -0.0594 -2.5661 -1.7670
quadrupole: -11.9540 4.0066 7.9474 -0.0594 -2.5661 -1.7670
hfenergy: -993.5156472 hartree
pointgroup: C01 [X(C16H26N4O2)]
dipole: 1.9549725 -0.2770312 0.5688823 debye
polarizability: 292.6664472|-4.3648729|204.9438186|26.3488008|5.3266499|148.3383531 unknown
InChI: InChI=1S/C16H26N4O2/c1-5-6-7-8-9-10-11-12-17-14-13(18(12)2)15(21)20(4)16(22)19(14)3/h5-11H2,1-4H3
charge 0 multiplicity 1
48 atoms
O  -3.582603 -2.644788 -0.519843
O  -5.663262 1.577279 -0.833332
N  -1.110686 -1.080091 0.600719
N  -1.162988 1.192573 0.836288
N  -3.46798 1.522684 -0.003692
N  -4.599872 -0.506133 -0.66544
C  2.055236 0.082284 0.346106
C  3.500873 0.138095 0.886654
C  1.000364 0.045268 1.49076
C  4.565753 0.090554 -0.232008
C  -0.41373 0.05919 0.9947
C  6.013652 0.184384 0.300617
C  -2.378305 -0.652945 0.166427
C  -2.369234 0.742102 0.325085
C  7.082036 0.075978 -0.810515
C  -3.505319 -1.385224 -0.345893
C  8.529859 0.182303 -0.279055
C  -0.646762 -2.478477 0.648782
C  -4.635496 0.911828 -0.517677
C  -3.427781 2.985783 0.18145
C  9.591705 0.053427 -1.392479
C  -5.836113 -1.114436 -1.20878
H  1.857096 0.965632 -0.29103
H  1.938284 -0.809303 -0.303292
H  3.632627 1.064992 1.482409
H  3.668154 -0.708513 1.585598
H  1.179503 -0.847218 2.121764
H  1.133707 0.934691 2.131422
H  4.44877 -0.851108 -0.808378
H  4.384636 0.918027 -0.94916
H  6.143628 1.144417 0.842623
H  6.181935 -0.619341 1.0482
H  6.911073 0.87154 -1.565919
H  6.959471 -0.8898 -1.344384
H  8.655411 1.152406 0.243963
H  8.69567 -0.605399 0.484339
H  0.270149 -2.602855 0.048093
H  -0.442343 -2.78346 1.690116
H  -1.444434 -3.115057 0.235433
H  -4.401911 3.387486 -0.132904
H  -2.619412 3.42255 -0.428603
H  -3.238172 3.227184 1.240727
H  9.468214 0.84807 -2.152567
H  10.61711 0.131127 -0.986508
H  9.505907 -0.920674 -1.91024
H  -5.66851 -2.199784 -1.265847
H  -6.052701 -0.702347 -2.207889
H  -6.690212 -0.887697 -0.550044
