program: Gaussian 09
title: 000265698
version: EM64L-G09RevD.01
frameworkgroup: C1[X(C25H20N2O5)]
method: RPBEPBE
basis: SDD
operation: Freq
keyword: #p
keyword: freq=noraman
keyword: PBEPBE/SDD
title: #p freq=noraman PBEPBE/SDD
converged: YES YES NO NO
title: Mulliken charges:
elementType: O O O O O N N C C C C C C C C C C C C C C C C C C C C C C C C C H H H H H H H H H H H H H H H H H H H H
charge: -0.278591 -0.274914 -0.254840 -0.265636 -0.195873 0.037389 -0.018787 0.025610 0.013037 -0.024671 0.439119 0.226229 0.202152 0.063950 -0.379631 0.067460 -0.365923 -0.335761 -0.508851 0.345995 -0.381187 -0.349406 -0.385491 -0.340666 0.321760 -0.342009 0.311642 -0.222567 -0.218079 -0.763671 -0.536021 -0.537648 0.274590 0.264069 0.244830 0.290136 0.244300 0.248183 0.236743 0.263832 0.262084 0.235129 0.234562 0.247707 0.251232 0.244277 0.225190 0.249586 0.224185 0.219344 0.221690 0.244213
chargesum: 0.00000
title: Mulliken charges with hydrogens summed into heavy atoms:
elementType: O O O O O N N C C C C C C C C C C C C C C C C C C C C C C C C C
charge: -0.278591 -0.274914 -0.254840 -0.265636 -0.195873 0.037389 -0.018787 0.025610 0.013037 -0.024671 0.439119 0.226229 0.202152 0.063950 -0.105041 0.067460 -0.101854 -0.090931 -0.218715 0.345995 -0.136887 -0.101224 -0.148748 -0.076834 0.321760 -0.079925 0.311642 0.012562 0.016483 -0.020455 0.162939 0.147598
polarizability: 4.33392465e+02 -5.64741140e+01 4.10501792e+02 -9.14612641e+00 1.86429199e+01 1.87761089e+02
1716.lowfreq: -0.0004 0.0004 0.0005 1.7149 4.2017 6.1620 25.4937 29.3145 38.9783
frequency: 25.4265 29.2899 38.9671 41.5880 45.3953 52.7246 59.8343 79.9275 86.9662 90.6306 99.4046 105.0424 137.0501 147.9344 169.3176 182.9954 193.4483 213.6623 225.2551 228.1587 245.7680 253.0190 262.1701 273.3714 297.0246 310.4764 330.7963 345.5936 364.7507 372.2250 415.4570 430.2017 450.0393 473.6958 476.5583 489.5260 505.1826 511.4835 528.7788 542.6222 543.1750 556.7813 569.0695 578.7846 599.5475 609.8586 620.9070 631.2820 635.5470 650.9124 698.0581 711.8061 725.2779 736.0547 751.4661 762.2839 773.2814 776.3548 794.2966 808.3838 815.4293 831.2852 841.4896 853.3641 877.1928 880.0490 887.9179 901.0033 926.4978 943.3125 968.6071 970.9186 973.8723 975.9232 985.9250 989.3988 997.9076 1001.4493 1009.3011 1016.6104 1035.1953 1037.6514 1107.8152 1111.6080 1112.4973 1115.5169 1118.5824 1136.9871 1151.3921 1157.3621 1160.0813 1170.3816 1174.1391 1182.0777 1212.4934 1227.3568 1232.2788 1256.3882 1260.1856 1273.1256 1301.4612 1302.4323 1341.0338 1357.5783 1377.7547 1378.7713 1386.2487 1410.3357 1419.3900 1436.1296 1436.8578 1441.7298 1451.8631 1452.5536 1453.1884 1466.6417 1468.2207 1469.8599 1472.7106 1473.7697 1501.4030 1504.2145 1524.4964 1547.2746 1571.7067 1587.0770 1615.5780 1625.3410 1633.1552 1675.9956 2957.7835 2966.6903 3006.7892 3045.1901 3057.7118 3096.1809 3122.9670 3130.9250 3135.1634 3140.7799 3148.6965 3149.1197 3154.8060 3159.3821 3162.9859 3170.1380 3173.0124 3175.4458 3184.2060 3187.1640
redmass: 5.3127 4.9755 4.3668 3.8232 2.1446 3.6245 4.0900 1.7825 3.7765 4.0657 3.7928 4.9238 5.5583 5.0794 4.3801 5.3883 5.6246 1.6369 2.0328 3.0325 2.4221 2.3946 4.5828 6.9692 4.2097 5.1059 6.3692 4.7429 5.3242 6.4248 2.9538 4.8563 3.5035 5.3989 4.3481 3.9808 5.6825 4.4914 5.3869 4.9022 4.0037 3.9139 3.6411 5.9030 8.2056 7.2991 4.7270 7.0623 5.8906 8.0545 5.7103 4.3048 7.1881 4.4369 3.8167 5.6291 5.7385 1.3445 3.2749 1.4496 1.5878 1.9932 6.2757 3.4272 2.3185 2.9018 1.7605 6.2874 3.4912 1.7064 1.3572 1.3615 1.3838 3.6502 3.0988 8.2652 1.3267 3.0738 2.1705 2.5761 6.2453 1.6648 2.4568 1.2606 1.2602 1.5864 1.3935 1.6104 1.8712 1.3208 1.5835 1.6284 2.2467 1.4182 2.1530 2.1891 3.0587 5.3118 2.9074 2.2442 1.5968 1.8818 4.5811 3.9042 5.0336 1.2842 5.9763 6.2628 3.9077 1.2765 1.1758 4.4471 1.0509 1.0748 2.4900 1.0501 1.0546 2.4293 1.0749 1.2822 2.7481 3.4502 9.4871 7.2197 8.6589 7.6014 6.6016 6.4687 7.5259 10.2906 1.0330 1.0326 1.0362 1.1039 1.1042 1.0974 1.0992 1.0999 1.0859 1.1013 1.0894 1.0874 1.0878 1.0888 1.0957 1.0959 1.1006 1.0958 1.0961 1.0930
irintensity: 1.6407 0.1538 1.0661 1.0082 2.2933 0.9941 1.1226 1.1296 1.3324 1.4118 2.2587 0.5738 7.9244 2.4730 3.4220 2.4942 0.2541 0.0634 0.9048 1.6281 1.0639 1.1936 1.1948 1.8934 3.1347 0.5854 3.9895 4.1678 0.3527 1.3627 0.3198 3.1658 2.9919 6.5050 13.3866 0.2429 10.0783 6.2655 28.6197 11.5421 2.7376 1.7663 19.1884 10.2610 3.4911 0.7071 2.8435 6.5422 18.2553 5.9141 3.4591 9.3412 2.4495 2.5099 2.6451 4.3891 1.5459 70.4027 28.3930 23.9541 85.0627 53.1987 320.0513 68.0340 54.7598 21.6175 0.1155 14.3058 48.1794 23.5971 2.4724 4.8539 7.3019 50.0418 25.9237 38.5628 0.0231 121.4849 7.3696 31.2117 38.5199 8.6770 293.2334 1.3937 0.2449 22.3057 9.8199 65.4978 38.8488 4.6843 99.3347 170.0560 96.2286 95.8474 17.7285 16.0312 152.4394 172.3891 3.0815 111.5579 2.5635 4.6055 0.6663 177.8992 25.9508 49.1206 38.1400 147.5480 7.9604 2.0893 7.5184 22.7633 17.6320 14.8338 20.3152 12.6434 14.8999 11.2185 51.9822 64.8826 150.6346 21.9054 128.9473 4.8964 49.0461 16.6318 29.8824 136.2997 368.7241 213.5120 72.6718 88.9387 2.7668 46.9844 42.6021 5.8888 30.3072 25.0271 2.2475 11.6258 6.6853 11.1664 1.6020 5.1661 13.5363 10.2132 36.3473 13.5668 3.1203 0.5840
temp: 298.150 k
press: 1.00000 atm
elementType: 8 8 8 8 8 7 7 6 6 6 6 6 6 6 6 6 6 6 6 6 6 6 6 6 6 6 6 6 6 6 6 6 1 1 1 1 1 1 1 1 1 1 1 1 1 1 1 1 1 1 1 1
symmnumber: 1
zpe: 1028521.5 jmol-1
zpe.correction: 0.391743 hartree
zpe.thermalcorrener: 0.419617 hartree
zpe.thermalcorrenthalpy: 0.420562 hartree
zpe.thermalcorrgfe: 0.332056 hartree
zpe.sumelectzpe: -1448.032685 hartree
zpe.sumelectthermal: -1448.004810 hartree
zpe.sumelectthermalent: -1448.003866 hartree
zpe.sumelectthermalfe: -1448.092372 hartree
dipole: 1.6438 3.4890 1.9706
dipole: 4.3311
quadrupole: -128.7082 -179.4577 -179.6530
quadrupole: -9.9671 -8.5649 -0.2845
quadrupole: 33.8981 -16.8514 -17.0467 -9.9671 -8.5649 -0.2845
hfenergy: -1448.4244279 hartree
pointgroup: C01 [X(C25H20N2O5)]
dipole: -0.6528236 -1.3309459 0.8402269 debye
polarizability: 431.9290868|-56.9201725|410.483331|6.5544733|-26.439805|189.2429282 unknown
InChI: InChI=1S/C25H20N2O5/c1-15(28)31-25(16-8-10-17(29-2)11-9-16)24-23(26-20-6-4-5-7-21(20)27-24)19-13-12-18(30-3)14-22(19)32-25/h4-14H,1-3H3
charge 0 multiplicity 1
52 atoms
O  -0.624036 1.462911 -0.505712
O  0.152989 0.847999 1.700596
O  -5.165422 2.852994 -0.83006
O  5.558629 2.255492 -1.640314
O  0.601259 3.167513 1.654203
N  1.07219 -1.712855 0.164891
N  -1.657943 -2.590055 -0.04714
C  0.358115 0.655408 0.213108
C  0.055699 -0.847785 0.079525
C  -1.328368 -1.274849 -0.048109
C  1.73543 1.093984 -0.245333
C  -2.368698 -0.259184 -0.194137
C  -1.980916 1.092665 -0.414835
C  0.757928 -3.065752 0.1456
C  -3.752655 -0.5609 -0.18572
C  -0.622586 -3.502758 0.060144
C  1.906684 1.803599 -1.459302
C  2.872424 0.755101 0.519958
C  -2.922245 2.108624 -0.6263
C  -4.298597 1.778013 -0.615032
C  -4.721134 0.436528 -0.389815
C  3.190307 2.17339 -1.894422
C  4.166495 1.12487 0.098732
C  1.804217 -4.032835 0.225252
C  4.325314 1.83687 -1.116416
C  -0.913319 -4.902582 0.07453
C  0.301552 2.137902 2.281045
C  1.492614 -5.396021 0.231496
C  0.12878 -5.830248 0.159013
C  0.025414 2.028204 3.766783
C  -6.607476 2.583334 -0.82662
C  6.762911 1.943643 -0.868515
H  -4.045584 -1.60307 -0.026193
H  1.0293 2.079273 -2.049193
H  2.748033 0.192833 1.450208
H  -2.600905 3.139339 -0.791619
H  -5.781918 0.172916 -0.377441
H  3.337932 2.72804 -2.825784
H  5.029331 0.855004 0.714495
H  2.835629 -3.671023 0.280904
H  -1.961401 -5.21104 0.011797
H  2.292576 -6.14164 0.292202
H  -0.094132 -6.902823 0.167175
H  0.730132 1.317653 4.232648
H  -0.992926 1.637023 3.934422
H  0.127988 3.017927 4.234953
H  -6.884838 1.876584 -1.631895
H  -7.079019 3.559506 -1.00978
H  -6.938651 2.185149 0.151574
H  6.897619 0.850088 -0.754651
H  6.73583 2.419719 0.131163
H  7.595449 2.360025 -1.45458
