program: Gaussian 09
title: 000024556
version: EM64L-G09RevD.01
frameworkgroup: C1[X(F4Si)]
method: RPBEPBE
basis: SDD
operation: Freq
keyword: #p
keyword: freq=noraman
keyword: PBEPBE/SDD
title: #p freq=noraman PBEPBE/SDD
converged: YES YES YES YES
title: Mulliken charges:
elementType: Si F F F F
charge: 1.692008 -0.422990 -0.423027 -0.423021 -0.422970
chargesum: 0.00000
title: Mulliken charges with hydrogens summed into heavy atoms:
polarizability: 1.92662588e+01 4.79165594e-04 1.92663691e+01 4.92994250e-04 1.52300424e-03 1.92565246e+01
1716.lowfreq: -13.3561 0.0013 0.0015 0.0021 8.7670 11.7765 201.5358 201.9252 305.3796
frequency: 201.5353 201.9243 305.3786 305.5172 305.8700 649.4709 894.5520 895.0316 895.9707
redmass: 18.9984 18.9984 20.4205 20.4216 20.4228 18.9984 22.7475 22.7514 22.7486
irintensity: 0.0007 0.0017 55.7204 55.7738 55.8091 0.0017 175.0528 175.2040 175.1379
temp: 298.150 k
press: 1.00000 atm
elementType: 14 9 9 9 9
symmnumber: 1
zpe: 27844.6 jmol-1
zpe.correction: 0.010605 hartree
zpe.thermalcorrener: 0.016093 hartree
zpe.thermalcorrenthalpy: 0.017038 hartree
zpe.thermalcorrgfe: -0.018772 hartree
zpe.sumelectzpe: -688.518858 hartree
zpe.sumelectthermal: -688.513370 hartree
zpe.sumelectthermalent: -688.512426 hartree
zpe.sumelectthermalfe: -688.548235 hartree
dipole: -0.0015 0.0021 -0.0012
dipole: 0.0028
quadrupole: -35.1106 -35.1097 -35.1060
quadrupole: 0.0001 0.0000 0.0004
quadrupole: -0.0018 -0.0010 0.0028 0.0001 0.0000 0.0004
hfenergy: -688.5294637 hartree
pointgroup: C01 [X(F4Si1)]
dipole: 0.0007703 0.0002388 0.0007586 debye
dipolederiv: 2.1963439 0.0001431 0.0000623 0.000111 2.1964852 -0.0001032 0.0000463 -0.0000412 2.1964306 -0.5204622 0.0266354 0.0394132 0.0265035 -0.540458 -0.0568347 0.0392753 -0.0568996 -0.5862333 -0.5604159 -0.0659826 -0.0218642 -0.0658984 -0.576635 -0.0246549 -0.0219088 -0.0247723 -0.5103301 -0.5042487 -0.0107115 0.0137413 -0.0107827 -0.5543849 0.0671885 0.0138826 0.0673671 -0.5887717 -0.6112171 0.0499156 -0.0313526 0.0500665 -0.5250072 0.0144042 -0.0312954 0.014346 -0.5110954 unknown
polarizability: 19.2649047|-0.004044|19.2581898|-0.0005548|-0.0001508|19.266058 unknown
InChI: InChI=1S/F4Si/c1-5(2,3)4
charge 0 multiplicity 1
5 atoms
Si 0.000163 0.000036 0.000153
F  -0.602313 0.869181 1.287705
F  -1.071276 -1.210907 -0.401933
F  0.207583 1.01339 -1.306222
F  1.465843 -0.6718 0.420296
