program: Gaussian 09
title: 000265579
version: EM64L-G09RevD.01
frameworkgroup: C1[X(C10H6O2)]
method: RPBEPBE
basis: SDD
operation: Freq
keyword: #pfreq=noraman
keyword: PBEPBE/SDD
title: #p freq=noraman PBEPBE/SDD
converged: NO YES NO NO
title: Mulliken charges:
elementType: O O C C C C C C C C C C H H H H H H
charge: -0.263960 -0.165770 0.372088 -0.290027 -0.297092 0.119350 -0.382790 0.033982 -0.003980 -0.753002 -0.016176 0.049892 0.273373 0.275427 0.269777 0.260241 0.259353 0.259316
chargesum: 0.00000
title: Mulliken charges with hydrogens summed into heavy atoms:
elementType: O O C C C C C C C C C C
charge: -0.263960 -0.165770 0.372088 -0.016653 -0.021665 0.119350 -0.113013 0.033982 -0.003980 0.025907 -0.016176 0.049892
polarizability: 3.79819237e+02 -8.42438582e+00 8.70958390e+01 2.44727128e-02 -1.29137217e-03 4.77672884e+01
1716.lowfreq: -29.1582 -14.1991 -4.6768 -0.7307 0.0003 0.0007 0.0008 36.3585 46.6784
frequency: -28.8992 36.3505 46.6691 111.4296 124.3367 194.2052 236.6607 283.5528 292.6861 299.9371 365.7448 418.3515 480.4250 491.5671 503.3662 581.1646 618.6002 687.9326 694.7734 719.3555 770.8636 810.1181 856.6947 879.8399 936.7731 1014.2854 1020.2093 1023.0055 1038.4061 1069.4074 1174.7963 1274.7267 1312.0240 1394.1796 1404.6642 1452.3660 1452.8126 1531.6130 1614.6012 1705.4967 2158.6717 2266.2148 2972.3614 3060.3924 3064.0393 3112.4175 3212.5575 3241.9712
redmass: 1.0308 5.3496 5.8828 6.5864 5.1336 6.1039 6.4612 3.7406 6.0872 4.6413 7.0496 5.6198 6.9928 10.3465 8.8786 3.4157 6.2688 7.8143 4.9296 5.9279 8.6195 1.4931 1.5105 7.6243 1.3299 3.5271 1.3905 1.3961 2.2374 1.5806 2.0476 1.6077 3.1248 1.6591 2.1676 1.0405 1.0407 6.3356 9.2487 12.3182 11.8137 11.8445 1.0349 1.0980 1.0983 1.0876 1.0921 1.1064
irintensity: 0.0404 0.0112 0.8688 4.5177 6.2377 5.0264 0.1139 3.8371 1.8686 0.0213 3.2843 7.8884 1.5535 0.1724 1.4831 4.9295 8.8535 8.0138 2.4152 11.8741 145.1010 69.6928 21.5597 5.2374 0.3610 14.3699 6.0298 5.2655 47.5089 17.7883 118.3093 35.2099 59.4065 2.2784 3.0009 13.7678 15.5201 100.9486 15.3403 837.1214 7.1032 171.0337 28.9589 7.7025 8.1796 8.1354 0.7850 0.2211
temp: 298.150 k
press: 1.00000 atm
elementType: 8 8 6 6 6 6 6 6 6 6 6 6 1 1 1 1 1 1
symmnumber: 1
zpe: 323067.2 jmol-1
zpe.correction: 0.123050 hartree
zpe.thermalcorrener: 0.133914 hartree
zpe.thermalcorrenthalpy: 0.134858 hartree
zpe.thermalcorrgfe: 0.085077 hartree
zpe.sumelectzpe: -534.166920 hartree
zpe.sumelectthermal: -534.156056 hartree
zpe.sumelectthermalent: -534.155112 hartree
zpe.sumelectthermalfe: -534.204893 hartree
dipole: 6.8645 2.4849 0.0001
dipole: 7.3005
quadrupole: -67.2185 -62.5936 -69.6800
quadrupole: -2.6497 0.0017 0.0007
quadrupole: -0.7212 3.9038 -3.1826 -2.6497 0.0017 0.0007
hfenergy: -534.2899699 hartree
pointgroup: C01 [X(C10H6O2)]
dipole: -2.6874233 1.013629 0.0004646 debye
dipolederiv: -1.3320937 -0.0382968 -0.0001635 -0.3780887 -0.6006977 -0.0003145 -0.0005092 -0.0003795 -0.1968693 -1.9842466 -0.097482 -0.0004285 0.3283133 -0.3633379 0.000033 0.0002558 -0.0000273 -0.3110289 0.6288533 -0.1026976 -0.0000606 -1.0912349 0.0184353 -0.0003164 -0.0006443 -0.0000187 0.0858347 0.6666903 0.1151416 0.00026 0.9295193 0.1386991 0.0004008 0.0007666 0.0001811 -0.0941699 -1.109038 -0.0536778 -0.0002374 0.486358 -0.0283139 0.0001809 0.0002415 0.0001129 -0.1761908 2.5945503 0.1277207 0.0005389 -0.4425882 0.6374281 0.0001333 -0.0001668 0.0002484 0.2688814 0.6955738 0.1128658 0.0002584 -0.1516646 0.111273 0.000035 -0.0000475 0.0002024 -0.1066548 -0.6388272 -0.0976119 -0.0002194 0.2327036 -0.1145889 0.0001617 0.0001539 -0.0000769 -0.0746996 0.7853345 -0.0431179 0.000158 -0.1768431 0.008386 -0.0000658 -0.0002047 -0.0000172 -0.0060913 -0.1323728 0.0436628 -0.0001362 0.1794952 0.072581 0.0001108 -0.0070006 -0.0005124 0.0695645 -0.7878431 0.0297477 -0.0002005 0.1959342 -0.0388666 0.0000705 0.0002148 0.0000146 -0.0353281 0.6677799 -0.1180769 0.0001658 -0.2490618 -0.0854001 -0.0000781 0.0024581 0.0002701 -0.1092288 0.0565874 0.074242 0.0000298 0.0519955 0.0705281 -0.0000788 -0.000009 -0.0000659 0.1743471 0.0824894 -0.0360394 -0.0000458 -0.006708 0.0210219 -0.0001197 -0.0000423 -0.0001161 0.195117 0.017096 0.0597521 0.0000777 0.0766701 0.0342013 -0.0001037 0.0000491 -0.0000561 0.1834314 -0.0860856 -0.0540231 0.0018984 -0.0868088 -0.0143663 0.0031444 0.0042446 0.003103 0.1385021 -0.0632004 0.038975 -0.0225093 0.0509659 0.0699892 0.090234 -0.0641498 0.0944374 -0.0057525 -0.0612474 0.0389157 0.0206142 0.0510428 0.0630284 -0.0934273 0.0643898 -0.0972998 0.0003359 unknown
polarizability: 379.9919971|4.5129438|86.9230462|0.0612474|0.0309137|47.767321 unknown
InChI: InChI=1S/C10H6O2/c1-2-3-4-5-6-9-7-8-10(11)12-9/h6-8H,1H3
charge 0 multiplicity 1
18 atoms
O  2.752032 -0.908021 -0.00051
O  4.925607 0.029781 0.00043
C  1.45209 -0.358541 -0.000254
C  1.544341 1.095482 0.00082
C  2.874287 1.447424 0.001254
C  3.701365 0.223541 0.000594
C  0.352121 -1.195201 -0.000972
C  -0.983194 -0.750023 -0.000821
C  -2.188493 -0.419316 -0.000705
C  -6.111981 0.671476 -0.00013
C  -3.501969 -0.049415 -0.00052
C  -4.700584 0.283046 -0.000333
H  0.674601 1.751722 0.001145
H  3.31421 2.442982 0.001997
H  0.542587 -2.277138 -0.00169
H  -6.769428 -0.217351 0.01915
H  -6.362667 1.259483 -0.902843
H  -6.353627 1.291668 0.883288
