program: Gaussian 09
title: 000265590
version: EM64L-G09RevD.01
frameworkgroup: C1[X(C10H13N2O5P)]
method: RPBEPBE
basis: SDD
operation: Freq
keyword: #p
keyword: freq=noraman
keyword: PBEPBE/SDD
title: #p freq=noraman PBEPBE/SDD
converged: NO YES NO NO
title: Mulliken charges:
elementType: P O O O O O N N C C C C C C C C C C H H H H H H H H H H H H H
charge: 1.338571 -0.449968 -0.469640 -0.529324 -0.188437 -0.185356 0.131236 -0.882703 0.207661 -0.330138 -0.329506 -0.677426 0.552202 -0.417686 -0.346719 -0.193202 -0.217911 -0.256958 0.276975 0.224972 0.203331 0.276747 0.254416 0.249289 0.225147 0.350824 0.220665 0.269959 0.228605 0.231418 0.232959
chargesum: 0.00000
title: Mulliken charges with hydrogens summed into heavy atoms:
elementType: P O O O O O N N C C C C C C C C C C
charge: 1.338571 -0.449968 -0.469640 -0.529324 -0.188437 -0.185356 0.131236 -0.531879 0.207661 0.171809 0.150571 0.051425 0.552202 -0.197021 -0.076760 0.035403 0.013507 -0.023999
polarizability: 1.97073539e+02 -1.84212176e+01 1.26787764e+02 8.39538117e+00 3.16169668e+00 1.47696631e+02
1716.lowfreq: -20.5938 -5.9281 -0.0011 0.0009 0.0010 2.8943 20.4064 25.2057 29.8416
frequency: 19.7300 24.9576 29.7644 51.3419 67.8081 117.6353 129.0762 183.8750 197.1652 219.3895 233.2227 241.3009 265.8600 276.2529 300.5716 315.5156 356.3418 392.5638 405.1028 406.8196 410.4898 488.7709 513.2910 521.7436 538.1249 550.3542 574.6564 607.5698 622.1026 656.0979 682.5825 692.6540 759.8854 763.0271 770.2249 826.7342 834.5500 871.0858 885.4449 897.1388 932.7210 964.1495 968.6938 982.8991 984.2244 988.0203 1011.5744 1027.5818 1083.2961 1090.3335 1101.1206 1148.5990 1172.7275 1195.6842 1208.0866 1217.8237 1243.8048 1273.2284 1285.1368 1310.4679 1348.0534 1360.5782 1367.6751 1397.4707 1401.4400 1410.7716 1433.6477 1438.0135 1465.8120 1469.3399 1479.2786 1486.3177 1598.8113 1615.5136 2991.6452 2997.9719 3007.5790 3099.9839 3104.6732 3113.1122 3115.8204 3119.2940 3133.8388 3143.7203 3153.6998 3171.3430 3529.6161
redmass: 6.4475 4.3883 8.6453 6.0930 7.4609 6.8452 6.0591 1.2196 3.2794 7.2612 3.0643 3.2997 6.8343 4.6725 6.1943 3.6828 2.6004 3.9854 3.7350 5.5558 6.2785 1.7229 4.4052 5.2827 2.1630 4.9641 5.9557 6.6547 7.2496 8.6433 6.4011 1.8829 2.5456 7.3824 3.2570 1.2651 3.1998 5.0227 1.8934 1.4982 3.7273 1.3739 3.5976 1.8354 5.3330 1.3449 1.9923 2.1409 3.7863 1.6665 11.0677 2.1597 1.0498 1.1132 1.4415 11.9945 2.0508 2.0260 1.2236 1.7154 1.1980 1.7288 1.2468 1.2156 3.0367 2.1382 1.5827 1.1534 2.0457 1.0875 1.0521 2.3835 5.9035 6.0998 1.0647 1.0380 1.0641 1.1004 1.1013 1.0973 1.0883 1.0997 1.0862 1.0917 1.0959 1.1014 1.0754
irintensity: 1.7123 0.6071 0.0944 2.0342 0.7410 0.3499 1.3414 0.8692 3.2628 0.7598 1.4279 2.4611 9.1726 3.2018 6.7739 1.7114 14.9669 1.3655 16.3111 27.6827 45.3975 57.7472 13.4983 4.9504 13.0851 4.9347 5.0703 16.1348 95.2027 98.2949 16.7327 37.2403 39.6203 38.6736 106.2993 0.4446 10.6705 168.6769 9.6055 16.3243 11.0037 0.2964 180.3105 6.1990 0.3417 1.4987 103.6028 11.9238 8.5846 14.9937 157.3384 4.7123 0.8466 3.6603 2.4343 78.8849 55.8614 0.3922 6.7067 110.0178 15.7903 40.5012 0.9756 20.3212 14.8493 124.2398 29.1915 16.9840 10.3955 5.1294 13.7916 139.8628 5.6584 109.3103 19.9892 8.6921 39.1270 11.1391 6.1679 2.5359 11.9518 1.1848 1.4739 17.9193 20.5097 16.0222 29.2821
temp: 298.150 k
press: 1.00000 atm
elementType: 15 8 8 8 8 8 7 7 6 6 6 6 6 6 6 6 6 6 1 1 1 1 1 1 1 1 1 1 1 1 1
symmnumber: 1
zpe: 603193.1 jmol-1
zpe.correction: 0.229744 hartree
zpe.thermalcorrener: 0.247349 hartree
zpe.thermalcorrenthalpy: 0.248293 hartree
zpe.thermalcorrgfe: 0.182074 hartree
zpe.sumelectzpe: -1214.252836 hartree
zpe.sumelectthermal: -1214.235231 hartree
zpe.sumelectthermalent: -1214.234286 hartree
zpe.sumelectthermalfe: -1214.300505 hartree
dipole: 2.6058 -7.6491 -4.2139
dipole: 9.1135
quadrupole: -117.8511 -122.6459 -106.8323
quadrupole: 6.9210 6.1121 0.5451
quadrupole: -2.0747 -6.8695 8.9442 6.9210 6.1121 0.5451
hfenergy: -1214.4825797 hartree
pointgroup: C01 [X(C10H13N2O5P1)]
dipole: 0.9854498 3.4465474 0.0787055 debye
polarizability: 196.9088891|13.1142111|134.1668377|-15.8667155|10.2586498|140.4822062 unknown
InChI: InChI=1S/C10H13N2O5P/c1-10(12(13)14)7-16-18(15,17-8-10)11-9-5-3-2-4-6-9/h2-6,11H,7-8H2,1H3
charge 0 multiplicity 1
31 atoms
P  -0.177946 -1.22355 0.799457
O  -0.699796 -0.88175 -0.82919
O  -1.469706 -0.562739 1.768253
O  0.095959 -2.757439 1.015389
O  -3.792981 -0.441559 -1.702643
O  -4.444788 -0.375873 0.477087
N  -3.638872 -0.093917 -0.478552
N  1.053087 -0.033966 1.144528
C  -2.415172 0.840473 -0.150851
C  -1.237578 0.473146 -1.080512
C  -2.062658 0.730191 1.349415
C  -2.905656 2.275615 -0.464867
C  2.302284 0.121283 0.470708
C  3.2627 1.013595 1.015899
C  2.592502 -0.577777 -0.729918
C  4.497194 1.207675 0.361179
C  3.832826 -0.375311 -1.371489
C  4.791043 0.516303 -0.836662
H  -1.565747 0.443264 -2.129604
H  -0.439092 1.22914 -0.946546
H  -1.361495 1.555868 1.584774
H  -2.969916 0.815801 1.965613
H  -3.224262 2.352203 -1.518318
H  -3.758204 2.54903 0.180443
H  -2.090429 2.99987 -0.29303
H  0.983577 0.394465 2.071951
H  3.046566 1.549263 1.949128
H  1.865513 -1.275955 -1.15905
H  5.231338 1.897109 0.792794
H  4.050391 -0.924546 -2.294123
H  5.751616 0.66469 -1.34026
