program: Gaussian 09
title: 000265589
version: EM64L-G09RevD.01
frameworkgroup: C1[X(C12H19N2O3P)]
method: RPBEPBE
basis: SDD
operation: Freq
keyword: #p
keyword: freq=noraman
keyword: PBEPBE/SDD
title: #p freq=noraman PBEPBE/SDD
converged: YES YES NO NO
title: Mulliken charges:
elementType: P O O O N N C C C C C C C C C C C C H H H H H H H H H H H H H H H H H H H
charge: 1.354184 -0.472055 -0.484988 -0.576226 -0.780283 -0.613249 0.218374 -0.342891 -0.326390 -0.698216 -0.175620 0.525229 -0.689157 -0.435189 -0.381897 -0.228662 -0.237878 -0.237990 0.215035 0.230080 0.252143 0.205705 0.229016 0.259800 0.204277 0.239158 0.351433 0.268473 0.288332 0.202329 0.261980 0.223794 0.230631 0.232023 0.228306 0.228243 0.232143
chargesum: 0.00000
title: Mulliken charges with hydrogens summed into heavy atoms:
elementType: P O O O N N C C C C C C C C C C C C
charge: 1.354184 -0.472055 -0.484988 -0.576226 -0.428849 -0.056443 0.218374 0.102224 0.131458 -0.005123 0.063538 0.525229 -0.001054 -0.204558 -0.149874 -0.000356 -0.009635 -0.005847
polarizability: 1.93603115e+02 -1.21578116e+01 1.83828829e+02 1.52800810e+01 7.37971086e+00 1.33860844e+02
1716.lowfreq: -17.3068 -9.0617 -3.6405 -0.0021 -0.0016 -0.0014 8.3788 15.2027 27.2786
frequency: -3.7799 14.0443 27.0419 55.8524 74.5193 111.3540 152.7775 159.8632 170.3277 210.8254 218.6656 239.0871 242.1926 248.4379 256.4799 277.9400 303.9643 338.8524 357.1628 387.8988 393.9320 402.3931 403.6543 421.4025 434.1143 454.3380 489.2282 496.3669 533.7164 557.5088 586.3158 616.2451 630.6389 673.7646 705.6847 760.2055 764.4520 771.5701 817.0375 854.2976 897.1339 915.0383 915.9949 922.3759 931.8277 951.1553 963.2792 977.3487 983.1990 990.2835 997.3940 1019.4965 1035.7308 1049.2021 1057.7925 1076.9077 1094.5594 1106.4293 1165.7821 1173.3146 1177.4349 1187.9179 1203.8439 1213.3270 1251.2839 1268.9387 1306.0887 1322.4506 1340.1577 1344.4813 1354.8041 1383.4763 1388.3571 1390.9416 1396.4667 1430.9888 1440.5258 1449.0624 1467.9853 1470.4204 1473.4819 1480.7172 1484.7377 1593.5140 1612.5648 1628.0730 2963.2601 2982.3499 2984.4699 2986.9915 3003.8667 3076.2414 3081.0375 3083.2126 3091.1306 3106.7839 3112.2658 3116.5290 3123.2774 3135.4476 3146.6392 3164.3054 3478.6865 3510.0745 3616.4951
redmass: 4.2190 3.7917 4.8605 3.6865 4.9142 4.0019 4.2456 3.5252 1.0645 5.0699 3.0094 2.4382 1.1377 2.1478 2.8268 2.3168 3.3627 4.0355 3.2939 7.2457 2.4185 2.8038 2.3057 3.8651 3.7762 1.4539 1.4624 3.8034 2.9613 5.3257 4.3628 6.4246 5.9222 8.3575 1.7481 2.1249 3.3012 3.8879 2.5905 1.2473 7.6960 2.1340 1.7147 1.5468 2.0837 3.4340 2.3806 1.3921 1.5827 5.7021 1.3326 2.2408 1.6335 1.6038 2.5544 12.5934 2.3846 1.8224 1.3593 1.0552 1.6983 1.1107 1.6786 2.0163 2.0598 1.4257 1.3584 1.1815 1.8213 1.3712 1.4125 3.3579 1.2798 1.3947 1.2078 1.0874 2.1077 1.0835 1.0989 1.0541 1.0643 1.1123 1.9137 5.9612 6.1442 1.1006 1.0643 1.0604 1.0360 1.0435 1.0850 1.0999 1.0991 1.0994 1.1008 1.1000 1.0988 1.0870 1.0861 1.0910 1.0959 1.1015 1.0447 1.0756 1.0996
irintensity: 1.4340 1.1863 1.6993 0.3621 0.2619 1.3103 4.1927 5.1385 1.2826 6.8340 0.7274 12.1602 1.1331 8.6397 25.5719 8.9391 1.4701 16.7104 22.3596 43.8490 42.7777 0.1131 2.5284 10.6673 5.4568 27.5525 226.4052 30.9314 52.0373 14.1411 3.0910 0.1160 63.3693 108.1761 60.1837 33.6892 11.7307 32.8837 89.9667 0.4833 7.9278 3.3299 20.7765 4.0189 79.6176 182.2185 81.0270 0.5568 5.4113 0.6451 0.6422 13.3773 5.3524 22.5937 35.2236 144.4316 84.7716 17.3589 3.6726 0.2452 9.9932 0.2490 13.3845 17.9010 3.9287 9.4311 10.5444 0.6814 2.4760 3.1101 1.1417 10.9888 13.2858 57.3442 18.7559 3.9954 10.1079 2.8047 5.8820 9.4402 12.1350 11.2087 12.2281 1.4698 2.5704 52.8161 33.3129 55.8865 19.5072 15.7384 6.7871 6.9155 35.5715 29.3537 18.7416 14.6526 14.1349 10.1649 2.5580 11.2386 39.2287 21.9131 3.8412 18.3153 3.9321
temp: 298.150 k
press: 1.00000 atm
elementType: 15 8 8 8 7 7 6 6 6 6 6 6 6 6 6 6 6 6 1 1 1 1 1 1 1 1 1 1 1 1 1 1 1 1 1 1 1
symmnumber: 1
zpe: 787522.6 jmol-1
zpe.correction: 0.299952 hartree
zpe.thermalcorrener: 0.318396 hartree
zpe.thermalcorrenthalpy: 0.319340 hartree
zpe.thermalcorrgfe: 0.252853 hartree
zpe.sumelectzpe: -1143.667921 hartree
zpe.sumelectthermal: -1143.649476 hartree
zpe.sumelectthermalent: -1143.648532 hartree
zpe.sumelectthermalfe: -1143.715020 hartree
dipole: 3.1382 -6.1722 -0.0606
dipole: 6.9244
quadrupole: -111.4590 -119.9435 -114.9111
quadrupole: 13.9415 6.9301 6.5590
quadrupole: 3.9789 -4.5056 0.5267 13.9415 6.9301 6.5590
hfenergy: -1143.9678725 hartree
pointgroup: C01 [X(C12H19N2O3P1)]
dipole: -1.2856515 2.3675408 -0.4044109 debye
polarizability: 191.7187617|-15.9549501|178.8769747|-16.3746203|-15.3516047|140.697051 unknown
InChI: InChI=1S/C12H19N2O3P/c1-10(11-6-4-3-5-7-11)14-18(15)16-8-12(2,13)9-17-18/h3-7,10,14H,8-9,13H2,1-2H3
charge 0 multiplicity 1
37 atoms
P  1.590687 -1.480743 0.341229
O  1.891593 -0.832729 -1.250912
O  2.525024 -0.472234 1.407658
O  1.961778 -3.016635 0.418569
N  -0.021026 -0.923725 0.678614
N  2.894645 2.780894 -0.483468
C  2.954306 1.312409 -0.362071
C  1.924799 0.657197 -1.335912
C  2.561897 0.990588 1.107457
C  4.385414 0.830603 -0.666003
C  -1.190992 -1.374402 -0.142032
C  -2.305036 -0.33656 0.024353
C  -1.614142 -2.827023 0.181746
C  -2.451878 0.702253 -0.929608
C  -3.183646 -0.364302 1.137718
C  -3.449596 1.690855 -0.778486
C  -4.178564 0.626763 1.296726
C  -4.315165 1.658197 0.339546
H  0.909491 1.05372 -1.122296
H  2.197183 0.860225 -2.385462
H  3.317753 1.39346 1.798546
H  1.570378 1.43164 1.337334
H  5.104501 1.331008 0.006086
H  4.468822 -0.258809 -0.523082
H  4.662163 1.057332 -1.713295
H  -0.845493 -1.34289 -1.193766
H  -0.226192 -0.718287 1.662643
H  1.965065 3.205917 -0.429605
H  3.498629 3.190041 -1.198757
H  -1.918914 -2.937588 1.238062
H  -0.764952 -3.510799 0.00659
H  -2.461047 -3.138277 -0.456032
H  -1.785186 0.728481 -1.801067
H  -3.105552 -1.16628 1.881313
H  -3.555721 2.480434 -1.530999
H  -4.850025 0.590732 2.161992
H  -5.090799 2.422733 0.459469
