program: Gaussian 09
title: 000265571
version: EM64L-G09RevD.01
frameworkgroup: C1[X(C6H10O3)]
method: RPBEPBE
basis: SDD
operation: Freq
keyword: #pfreq=noraman
keyword: PBEPBE/SDD
title: #p freq=noraman PBEPBE/SDD
converged: YES YES NO NO
title: Mulliken charges:
elementType: O O O C C C C C C H H H H H H H H H H
charge: -0.244953 -0.433100 -0.447183 -0.141068 -0.041618 -0.152356 -0.701112 -0.298913 -0.140173 0.260459 0.222886 0.258993 0.244909 0.233768 0.213351 0.237735 0.240410 0.347811 0.340152
chargesum: 0.00000
title: Mulliken charges with hydrogens summed into heavy atoms:
elementType: O O O C C C C C C
charge: -0.244953 -0.085289 -0.107031 0.119391 0.181268 0.106637 -0.009083 -0.061177 0.100237
polarizability: 8.08818268e+01 -1.34705787e+00 7.26645018e+01 2.70794787e+00 2.75184172e+00 6.13146123e+01
1716.lowfreq: -25.6771 -11.8173 -8.9328 -0.0010 -0.0009 -0.0002 81.8513 116.7579 175.4258
frequency: 81.7409 116.7134 175.3885 199.3521 228.7709 240.4768 267.4234 317.9104 347.7138 434.9209 451.0262 531.7056 590.9338 649.5286 717.2523 758.6279 815.1893 878.9512 885.7301 925.6316 951.9330 963.2835 1020.6312 1032.2579 1086.1700 1113.4700 1151.4855 1190.2257 1215.2743 1233.8148 1261.9362 1302.6284 1320.9102 1337.3036 1340.0927 1359.6649 1381.4797 1394.3509 1462.1979 1474.3296 1614.9080 2973.8449 3000.1164 3055.1084 3082.8744 3097.3222 3111.6702 3153.3766 3181.0516 3539.5921 3554.4412
redmass: 3.8884 4.1895 2.3544 1.0849 1.6604 2.0997 2.1520 2.0694 2.3075 4.7066 4.3006 4.0339 5.0286 3.9352 3.1339 1.3865 3.0472 4.4492 3.1591 1.2944 2.8512 3.0337 2.3384 1.9672 1.5602 1.9254 2.0581 1.2399 1.4147 1.4339 1.5396 1.2990 1.2183 1.4445 1.3883 1.2454 1.6639 1.2605 1.0457 1.0502 6.2943 1.0833 1.0365 1.0862 1.0872 1.0984 1.1010 1.0864 1.1008 1.0655 1.0666
irintensity: 22.5065 4.2894 35.7285 10.8850 25.2943 23.1297 19.8785 31.6391 59.0757 11.4166 0.9808 5.7067 5.9986 5.9433 10.0612 37.4697 14.1397 4.3819 146.5041 0.5917 16.1237 78.6983 73.2511 36.3713 14.8176 49.8243 13.0950 29.0591 22.6068 97.4271 4.4854 1.7056 5.2014 3.7032 25.0500 20.1614 24.4170 23.7136 13.3404 10.6263 91.3353 30.5909 18.2276 22.0408 8.5078 22.3723 16.4969 0.5478 19.7043 6.4915 5.3721
temp: 298.150 k
press: 1.00000 atm
elementType: 8 8 8 6 6 6 6 6 6 1 1 1 1 1 1 1 1 1 1
symmnumber: 1
zpe: 404174.7 jmol-1
zpe.correction: 0.153942 hartree
zpe.thermalcorrener: 0.163492 hartree
zpe.thermalcorrenthalpy: 0.164436 hartree
zpe.thermalcorrgfe: 0.119907 hartree
zpe.sumelectzpe: -459.548866 hartree
zpe.sumelectthermal: -459.539316 hartree
zpe.sumelectthermalent: -459.538372 hartree
zpe.sumelectthermalfe: -459.582901 hartree
dipole: 0.0232 2.2295 -0.8943
dipole: 2.4023
quadrupole: -55.2921 -56.3776 -53.3999
quadrupole: 5.7551 3.1196 2.6307
quadrupole: -0.2689 -1.3544 1.6233 5.7551 3.1196 2.6307
hfenergy: -459.7028083 hartree
pointgroup: C01 [X(C6H10O3)]
dipole: 0.0571164 -0.8828168 0.3326296 debye
dipolederiv: -1.1643056 0.0434356 0.2449723 0.4717146 -0.5343258 -0.1454593 0.2644762 -0.0587389 -0.3491679 -0.6056307 -0.0583793 -0.05779 -0.0902767 -0.1738432 0.059502 -0.0815227 0.1014541 -0.7618953 -0.6868144 0.0121513 -0.1662383 -0.1296636 -0.3698515 -0.1735311 -0.2219704 -0.253405 -0.6249587 0.1895118 -0.0111384 0.073114 0.1058078 0.1363744 -0.0156109 0.1649297 -0.0503631 0.508013 0.3698325 -0.1333976 -0.0310031 -0.431019 0.4456424 0.1959731 -0.1145943 0.0992514 0.3094265 0.3060206 -0.0014839 0.1679982 0.1601573 0.3855173 0.0194788 0.2577863 0.0890837 0.5449795 -0.1333406 0.0547386 0.0178599 0.0252535 0.0229645 -0.0012137 0.0523474 -0.0049389 0.0290196 -0.3189606 -0.0189458 -0.0854532 -0.2834051 -0.2370941 0.0275159 -0.1380658 0.0255674 -0.4044625 1.1066638 0.0297805 -0.2843678 -0.0114026 0.2889595 0.0261588 -0.3005719 0.0110299 0.0000189 0.0862036 0.0469629 0.0011895 0.0513596 -0.0698636 -0.0595437 -0.0194665 -0.0282636 0.0229984 0.003317 0.002206 -0.1181234 0.0980796 0.0068085 0.0072586 -0.0449891 -0.0124103 -0.1393223 -0.0035243 -0.0596655 0.0625949 -0.0694582 -0.00756 0.0624259 0.0270494 0.0361863 -0.0482926 0.0716944 0.010193 -0.0386608 -0.001608 0.1072363 -0.0014522 -0.1171392 0.005387 -0.0589233 0.0215689 -0.0526274 0.0535559 -0.1100025 -0.0126656 0.1004344 0.0521199 0.0843306 0.047127 0.0637197 0.0110983 0.0048394 0.0625742 -0.0709034 -0.1083136 0.0246058 -0.0937663 0.0528475 -0.0335609 0.0905882 0.0684397 0.0553839 0.0344964 -0.0155696 0.0798702 -0.0156388 0.1549967 0.0576831 0.0294749 0.0362953 0.0413014 -0.0772341 -0.0454437 0.0605823 -0.0305182 0.1598724 0.3156347 0.0387105 0.0090035 0.0315374 0.0271775 -0.0745261 0.0113403 -0.0349638 0.3331666 0.3542868 -0.0337019 0.0417742 0.0236665 0.0981645 0.1419163 0.0432125 0.1307166 0.2245566 unknown
polarizability: 80.6257953|1.843369|72.6981848|-3.1505185|2.8223865|61.5369608 unknown
InChI: InChI=1S/C6H10O3/c1-4-6(8)5(7)2-3-9-4/h2-8H,1H3
charge 0 multiplicity 1
19 atoms
O  -0.815395 -1.316988 0.148731
O  -0.71962 1.080264 -1.633574
O  1.885871 1.22602 1.062126
C  -0.214736 1.0701 -0.254866
C  -1.005784 0.093344 0.643643
C  1.299166 0.728744 -0.213787
C  -2.510069 0.334561 0.680911
C  1.507713 -0.753748 -0.409276
C  0.483733 -1.644021 -0.242703
H  -0.358521 2.100316 0.108463
H  -0.56769 0.129447 1.66366
H  1.803332 1.313565 -1.001781
H  -2.915061 0.401006 -0.342455
H  -3.017511 -0.483016 1.220203
H  -2.725539 1.284686 1.201697
H  2.488318 -1.126274 -0.718903
H  0.574899 -2.720117 -0.419852
H  -0.630221 0.165778 -2.008981
H  1.971517 0.455933 1.680444
