program: Gaussian 09
title: 000265557
version: EM64L-G09RevD.01
frameworkgroup: C1[X(C8H9N5)]
method: RPBEPBE
basis: SDD
operation: Freq
keyword: #p
keyword: freq=noraman
keyword: PBEPBE/SDD
title: #p freq=noraman PBEPBE/SDD
converged: NO NO NO NO
title: Mulliken charges:
elementType: N N N N N C C C C C C C C H H H H H H H H H
charge: -0.051787 -0.034997 -0.084806 -0.621955 -0.635686 0.186529 -0.082739 0.069542 -0.469297 0.227370 0.207474 -0.440032 -0.783883 0.245704 0.246325 0.228898 0.255593 0.228770 0.321089 0.348771 0.324373 0.314745
chargesum: 0.00000
title: Mulliken charges with hydrogens summed into heavy atoms:
elementType: N N N N N C C C C C C C C
charge: -0.051787 -0.034997 -0.084806 0.047905 0.003432 0.186529 -0.082739 0.069542 -0.223594 0.227370 0.207474 -0.193708 -0.070622
polarizability: 2.07574091e+02 1.11817346e+01 1.39456848e+02 -2.60669573e-02 1.91124837e-04 5.39309989e+01
1716.lowfreq: -10.9168 -2.0998 -0.0006 -0.0005 0.0003 6.1036 32.2897 93.0886 107.7169
frequency: 32.1333 93.0829 107.7160 216.5086 218.9536 266.6882 283.0793 295.6980 345.2826 394.1078 431.7198 448.5430 460.7443 481.7166 517.3935 532.9149 577.8523 593.0676 614.5021 652.1301 669.9392 702.9992 705.7004 773.6894 793.9112 836.2575 875.0202 914.1244 949.7049 991.0423 1021.0079 1044.3503 1112.8179 1135.5936 1204.8203 1227.8276 1268.7790 1290.2078 1361.7880 1385.5596 1420.1226 1421.3999 1457.4046 1464.2237 1464.2832 1481.9310 1515.8829 1545.3883 1587.0833 1609.4821 1620.8397 2983.7332 3062.1116 3120.1043 3136.2313 3169.1095 3521.7409 3557.9236 3691.1648 3714.6720
redmass: 1.0338 4.4138 4.2538 3.2895 5.1083 4.3065 4.6929 2.8468 3.0910 1.2241 5.7847 2.8885 6.5032 1.1067 1.5240 3.5662 5.7504 3.6296 1.0915 8.4804 3.9834 5.4236 5.3099 5.8804 2.1704 3.2200 1.3472 3.2368 2.3468 1.8177 1.8182 1.5976 3.5324 2.4025 2.0962 2.5155 3.0385 5.5607 2.8231 1.2554 4.4949 3.3851 2.3263 1.1312 1.7921 3.4185 4.4452 2.4604 1.7342 4.6110 1.6919 1.0379 1.0971 1.0984 1.0922 1.0929 1.0447 1.0446 1.1044 1.1049
irintensity: 0.6537 0.0074 6.8249 2.6817 14.7507 0.3502 0.0671 8.2895 0.2125 223.7274 0.0409 53.1669 4.8150 5.2392 249.8129 3.2468 2.6873 0.0191 62.0836 2.3634 4.4716 5.9898 23.8032 2.1856 14.6064 39.6855 13.9241 9.2732 8.7404 5.6452 4.4961 7.7545 2.3539 4.3201 17.9314 3.4944 57.3110 40.4844 62.0870 36.7438 30.2363 65.9280 46.4178 18.5366 27.4391 56.8826 183.7227 1.1611 202.5364 746.8693 386.6786 18.4343 18.2905 8.8726 15.5151 6.6321 89.8510 131.8739 58.8251 34.1840
temp: 298.150 k
press: 1.00000 atm
elementType: 7 7 7 7 7 6 6 6 6 6 6 6 6 1 1 1 1 1 1 1 1 1
symmnumber: 1
zpe: 444854.2 jmol-1
zpe.correction: 0.169436 hartree
zpe.thermalcorrener: 0.180773 hartree
zpe.thermalcorrenthalpy: 0.181718 hartree
zpe.thermalcorrgfe: 0.132070 hartree
zpe.sumelectzpe: -583.112047 hartree
zpe.sumelectthermal: -583.100709 hartree
zpe.sumelectthermalent: -583.099765 hartree
zpe.sumelectthermalfe: -583.149413 hartree
dipole: -0.9021 0.2888 -0.0228
dipole: 0.9475
quadrupole: -57.7811 -65.6200 -79.6168
quadrupole: 5.5929 0.1037 0.0723
quadrupole: 9.8916 2.0526 -11.9441 5.5929 0.1037 0.0723
hfenergy: -583.2814826 hartree
pointgroup: C01 [X(C8H9N5)]
dipole: -0.3538633 0.1164118 -0.0140023 debye
dipolederiv: -0.7744088 -0.2292771 -0.0048558 0.0042374 -0.2583357 -0.0003098 -0.0067873 -0.0036011 -0.2881134 0.5699264 -0.1360602 0.0101401 0.2528504 -0.3431855 0.0037953 0.0084417 -0.0011944 -0.2284253 -0.5464577 -0.4089536 -0.0011097 -0.2599409 -1.0876796 0.0014311 -0.00334 -0.0028162 -0.3003054 -0.2866107 0.2091018 0.0035257 0.3689262 -1.4913832 0.0079452 0.0025708 0.0071878 -0.6866274 -1.5029073 -0.6250771 -0.0042377 -0.8064932 -0.5308531 -0.0062089 0.0121677 0.0026915 -0.7232879 0.8879576 0.3619055 0.0068885 0.8683616 0.2760691 0.0104042 0.0042903 0.0042232 0.1536829 -0.6758345 0.4892875 -0.0117468 -0.7276278 -0.3272658 -0.0067883 -0.0041741 0.0079722 0.0745358 0.7809894 -0.1430445 0.0079223 -0.2843284 1.7253199 -0.0107012 0.0088177 -0.0095629 0.1790588 -1.2171787 -0.377448 -0.0088711 -0.0255105 -0.1560787 -0.0027402 -0.0118505 -0.0073607 -0.3018946 0.7846037 -0.0374134 0.0089436 -0.5053973 0.4298388 -0.0079851 0.0124433 -0.0025676 0.1069409 1.9020658 0.6816364 0.0162126 0.4790972 0.9844215 -0.0006491 0.0134601 0.0021777 0.1799543 -0.5243414 0.1923464 -0.0058784 0.5988486 -0.1254891 0.0074162 -0.0081231 0.0025497 -0.1011063 -0.351736 0.1090197 -0.0058936 0.0725934 0.01919 0.0009997 -0.0071664 0.0019727 0.043967 0.0628783 0.0171023 -0.0018465 -0.0331967 -0.0770855 0.0017042 -0.0013778 0.0031198 0.1955644 -0.0635749 -0.0830921 -0.002078 -0.0997743 0.0249548 -0.0005941 -0.0020502 -0.0004216 0.1389622 0.0058213 0.0012174 -0.0747137 -0.0063573 0.0679021 -0.0838487 -0.1215095 -0.048991 -0.0408874 0.103638 -0.0483416 0.0000445 0.0680721 -0.0882465 0.0016989 -0.0003306 0.0002595 0.1173244 0.0004969 0.0004355 0.0759983 -0.007919 0.0691062 0.0828178 0.123142 0.0479933 -0.0367495 0.1839309 -0.0612386 -0.0019786 -0.0348143 0.2401868 0.0004126 -0.0021127 -0.000128 0.384037 0.1956551 -0.0000253 -0.0019409 -0.0268234 0.3060628 -0.0000474 -0.0019862 0.0006897 0.3613931 0.2828732 0.0354812 -0.0023476 -0.0129089 0.1610697 0.0008022 -0.0064686 0.000077 0.3839556 0.1822136 0.0524379 -0.0021769 0.1181052 0.1814808 0.0004454 -0.0080565 -0.0042704 0.3880207 unknown
polarizability: 207.7265772|10.6414154|139.2802599|1.8250399|-0.3288971|53.9551002 unknown
InChI: InChI=1S/C8H9N5/c1-4-3-11-7-5(12-4)2-6(9)13-8(7)10/h2-3H,9-10H2,1H3
charge 0 multiplicity 1
22 atoms
N  1.490291 -1.288132 -0.015686
N  1.102704 1.561003 -0.037253
N  -2.40543 0.427306 -0.07434
N  -1.473868 2.589052 -0.072719
N  -3.391092 -1.674468 -0.072138
C  0.204282 -0.739831 -0.034617
C  0.037636 0.695255 -0.045211
C  -1.318239 1.226398 -0.063293
C  -0.943593 -1.569401 -0.044384
C  2.531949 -0.422936 -0.008474
C  -2.215244 -0.945814 -0.066365
C  2.334863 1.005178 -0.018877
C  3.92941 -1.002149 0.013546
H  -0.826236 -2.655576 -0.033332
H  3.191569 1.687155 -0.011802
H  4.485476 -0.669163 0.909902
H  3.870125 -2.101025 0.017697
H  4.510287 -0.677033 -0.869845
H  -2.407083 2.991238 -0.085482
H  -0.629694 3.161752 -0.066161
H  -4.26905 -1.161251 -0.08937
H  -3.387361 -2.689462 -0.078394
