program: Gaussian 09
title: 000265568
version: EM64L-G09RevD.01
frameworkgroup: C1[X(C12H12BrNO3)]
method: RPBEPBE
basis: SDD
operation: Freq
keyword: #p
keyword: freq=noraman
keyword: PBEPBE/SDD
title: #p freq=noraman PBEPBE/SDD
converged: NO YES NO NO
title: Mulliken charges:
elementType: Br O O O N C C C C C C C C C C C C H H H H H H H H H H H H
charge: -0.063178 -0.193475 -0.175205 -0.196701 -0.177196 -0.371730 -0.290955 0.172158 0.180561 -0.395619 0.117898 0.123780 -0.343920 -0.344806 -0.676348 -0.208522 -0.209219 0.237767 0.256749 0.237502 0.238463 0.310747 0.271374 0.270745 0.246972 0.227234 0.270733 0.242126 0.242065
chargesum: 0.00000
title: Mulliken charges with hydrogens summed into heavy atoms:
elementType: Br O O O N C C C C C C C C C C C C
charge: -0.063178 -0.193475 -0.175205 -0.196701 -0.177196 0.122786 0.185010 0.172158 0.180561 -0.084871 0.117898 0.123780 -0.072546 -0.074062 0.068591 0.033605 0.032846
polarizability: 2.54259462e+02 -6.91339453e+00 1.62984732e+02 1.45040807e+00 -6.78710308e-01 8.23307982e+01
1716.lowfreq: -8.6127 -0.0007 0.0004 0.0004 4.0753 5.1468 23.8275 25.8764 34.9934
frequency: 23.6061 25.8029 34.7099 61.8329 78.6269 128.7093 139.1476 173.4167 196.9602 216.0141 233.7970 251.0794 284.4901 302.0639 313.1639 345.3900 369.4893 403.8188 409.9623 454.3821 511.3568 532.2249 578.1126 615.8618 657.4786 685.8352 688.3456 697.9236 779.6648 785.0256 791.0272 829.1507 852.4325 908.1988 922.5149 937.0335 968.6555 974.9133 1008.1063 1015.0449 1017.3962 1034.1131 1056.7886 1084.5128 1119.0841 1149.1139 1165.8653 1168.2338 1179.8121 1192.2510 1196.7786 1251.3336 1273.8136 1284.2702 1338.3925 1345.8370 1366.4143 1396.7405 1415.2470 1449.7250 1452.0819 1453.7633 1462.2657 1472.9477 1488.4693 1611.1587 1618.3784 1642.5014 1684.9746 2976.6450 3004.6759 3012.7768 3066.1924 3069.3798 3083.9213 3092.6928 3109.5840 3141.8761 3154.8269 3166.1451 3176.1967
redmass: 5.5136 7.6185 4.6127 5.2336 5.8521 10.5359 5.0372 6.7298 3.9780 1.9145 6.5627 1.9213 9.5265 1.8434 7.0603 3.6752 4.7576 3.0001 2.4228 4.8843 7.4707 7.1457 6.0182 3.8491 4.8130 4.7786 6.6201 5.0515 4.8764 2.2676 1.4976 2.8470 7.7858 1.3869 2.0070 5.0631 1.7928 1.4089 1.3482 2.0506 1.7991 1.5753 4.3137 4.8585 1.8656 2.2582 1.4041 1.9347 1.2338 1.5830 1.5839 1.3873 4.4210 1.5135 1.3036 1.4846 1.3385 1.2100 6.2121 1.0863 2.7325 2.4442 1.0607 1.0668 1.0564 7.5141 7.5899 12.6611 12.6599 1.0384 1.0571 1.0607 1.1004 1.0987 1.1053 1.0940 1.0964 1.0866 1.0907 1.0956 1.1004
irintensity: 0.0583 0.2824 1.0538 4.5169 3.8464 4.8644 0.0631 0.6437 1.2314 1.2390 0.6955 2.9986 2.0437 8.2300 15.9627 2.0176 4.6818 2.0183 0.2152 0.0619 10.6416 10.7438 4.6430 16.4512 0.1027 39.0413 15.6346 30.3849 0.1965 1.3696 48.3026 11.4492 31.8616 0.0204 13.5959 129.3030 28.2097 2.1646 0.0056 0.0686 32.6241 19.8035 67.0379 17.0656 14.4744 18.1952 26.9620 2.1635 42.8706 16.4877 20.2623 2.7772 109.8841 2.2621 1.3187 8.9766 41.7462 26.6434 10.5712 10.3737 0.7831 12.4796 8.8467 4.3554 18.3724 2.5131 24.7901 443.1369 53.0267 9.3846 7.9668 27.2051 5.3867 7.5483 16.3341 11.3039 21.7878 1.6039 4.3861 4.5314 20.5427
temp: 298.150 k
press: 1.00000 atm
elementType: 35 8 8 8 7 6 6 6 6 6 6 6 6 6 6 6 6 1 1 1 1 1 1 1 1 1 1 1 1
symmnumber: 1
zpe: 571890.0 jmol-1
zpe.correction: 0.217821 hartree
zpe.thermalcorrener: 0.234052 hartree
zpe.thermalcorrenthalpy: 0.234996 hartree
zpe.thermalcorrgfe: 0.170958 hartree
zpe.sumelectzpe: -757.092586 hartree
zpe.sumelectthermal: -757.076356 hartree
zpe.sumelectthermalent: -757.075412 hartree
zpe.sumelectthermalfe: -757.139450 hartree
dipole: 6.1191 -1.3735 2.2137
dipole: 6.6506
quadrupole: -92.6935 -115.3463 -107.6310
quadrupole: -5.6640 -4.1684 2.0223
quadrupole: 12.5301 -10.1228 -2.4074 -5.6640 -4.1684 2.0223
hfenergy: -757.3104078 hartree
pointgroup: C01 [X(C12H12Br1N1O3)]
dipole: 2.3705449 0.5223975 -0.9767243 debye
polarizability: 253.8978511|6.0477176|162.8680013|-9.2152716|-0.5124946|82.8091394 unknown
InChI: InChI=1S/C12H12BrNO3/c1-8(13)6-7-17-14-11(15)9-4-2-3-5-10(9)12(14)16/h2-5,8H,6-7H2,1H3
charge 0 multiplicity 1
29 atoms
Br -6.144917 0.020103 0.607516
O  -1.423516 -0.723012 0.275683
O  0.773788 -2.688424 0.07651
O  -0.242655 1.939031 0.025564
N  -0.054938 -0.441248 0.057184
C  -3.662764 -0.838444 -0.64536
C  -2.182285 -0.740366 -1.028795
C  2.240797 -0.668733 -0.00704
C  1.939464 0.718522 -0.023208
C  -4.13628 0.331903 0.240231
C  0.963187 -1.453746 0.05221
C  0.452834 0.896659 0.025221
C  3.565176 -1.127988 -0.045437
C  2.95318 1.686193 -0.077539
C  -3.9507 1.730079 -0.350818
C  4.598138 -0.15518 -0.097586
C  4.297066 1.229808 -0.11313
H  -4.251189 -0.858849 -1.582497
H  -3.844591 -1.794826 -0.123682
H  -1.950875 0.188605 -1.579687
H  -1.859598 -1.622597 -1.610989
H  -3.700261 0.26242 1.24843
H  3.785584 -2.199915 -0.032318
H  2.708833 2.752916 -0.089211
H  -4.424239 2.492269 0.289694
H  -4.39012 1.804539 -1.361447
H  -2.869864 1.966662 -0.402841
H  5.644377 -0.477611 -0.125041
H  5.115163 1.95673 -0.152216
