program: Gaussian 09
title: 000265586
version: EM64L-G09RevD.01
frameworkgroup: C1[X(C16H17Cl2N2O2P)]
method: RPBEPBE
basis: SDD
operation: Freq
keyword: #p
keyword: freq=noraman
keyword: PBEPBE/SDD
title: #p freq=noraman PBEPBE/SDD
converged: YES YES NO NO
title: Mulliken charges:
elementType: Cl Cl P O O N N C C C C C C C C C C C C C C C C H H H H H H H H H H H H H H H H H
charge: -0.005260 -0.008082 1.347040 -0.451494 -0.583644 -0.516439 -0.858503 -0.371973 -0.372755 -0.596155 -0.295120 0.539217 0.539606 -0.302303 -0.442765 -0.420715 -0.339755 -0.094124 -0.201831 -0.111561 -0.195026 -0.217371 -0.261081 0.242244 0.225577 0.208077 0.246908 0.280047 0.235732 0.215470 0.241493 0.343862 0.309848 0.239423 0.218146 0.274645 0.257819 0.224321 0.227515 0.228968
chargesum: 0.00000
title: Mulliken charges with hydrogens summed into heavy atoms:
elementType: Cl Cl P O O N N C C C C C C C C C C C C C C C C
charge: -0.005260 -0.008082 1.347040 -0.451494 -0.583644 -0.516439 -0.514641 0.095848 0.082230 -0.080377 0.161843 0.539217 0.539606 0.007545 -0.203342 -0.202569 -0.065111 -0.094124 0.055988 -0.111561 0.029295 0.010145 -0.032114
polarizability: 3.24118647e+02 -3.32562350e+00 2.27725521e+02 1.15582392e+01 1.00982849e+01 1.42198284e+02
1716.lowfreq: -17.6780 -6.1321 -3.2387 -0.0020 0.0009 0.0013 14.2221 19.2398 23.4841
frequency: 13.9260 18.2104 23.2093 28.9161 43.0561 70.7336 80.8240 110.3875 129.1584 155.0357 158.0684 178.7065 186.8777 197.0023 257.4150 262.1793 273.5974 291.6131 306.9564 326.3722 360.7721 377.4044 401.3348 404.0528 412.7408 430.0966 437.8905 447.4706 460.9926 491.7629 519.8290 529.6377 560.1559 585.5828 600.6119 615.1017 640.9839 670.8447 684.0700 690.6721 727.5815 758.5682 770.6671 812.7052 819.1369 822.9789 849.7881 860.9530 875.3941 891.8719 893.4598 907.7917 939.3350 955.2049 959.8852 982.9385 983.4790 984.3347 1003.5908 1026.9961 1035.4464 1042.8214 1058.7381 1089.8777 1104.4520 1123.5930 1135.5550 1143.5583 1171.1632 1194.7813 1202.5984 1208.5711 1221.6438 1243.8706 1260.1819 1270.5361 1303.1199 1312.8011 1343.9117 1348.6010 1354.1868 1355.9838 1357.9878 1372.4126 1391.2402 1398.8275 1441.8099 1452.8946 1456.6272 1462.2644 1463.2770 1466.6358 1488.1636 1569.6855 1592.1525 1596.0847 1616.7495 2966.8442 2986.7016 2996.2708 2997.7154 3054.1992 3061.2063 3071.1163 3093.6600 3114.5055 3127.1233 3129.2736 3132.1198 3142.2192 3154.5457 3168.9014 3169.5480 3543.3145
redmass: 8.2381 6.6221 4.2372 7.9233 5.3889 8.7554 4.7970 4.5125 4.6783 5.2959 7.2022 5.8437 13.4834 4.4916 3.9870 5.7679 4.9910 6.0554 3.3338 4.9193 2.8873 5.2448 2.9181 5.6971 6.2324 5.6213 4.3680 3.6520 4.5364 1.4297 2.0539 2.3256 4.5733 6.3744 6.1748 6.5036 6.7145 6.2764 5.4574 1.8670 3.5468 2.3167 3.3119 2.1083 1.9627 1.2663 2.2776 2.5962 4.6413 1.8249 2.3070 2.1669 1.4370 1.3386 1.3749 1.6906 1.9616 3.5047 5.8591 2.1577 2.6921 2.7542 5.7147 1.5821 2.4088 2.3497 2.1993 1.5020 1.0500 1.1151 1.3894 2.1280 1.3537 1.7797 1.3104 1.4248 1.3887 1.8777 1.2325 1.3564 1.2924 1.3117 1.6226 5.8376 2.2123 3.6195 1.0891 1.6406 1.0840 2.0716 1.4706 1.0884 2.4245 7.3485 6.3877 5.9851 6.0933 1.0663 1.0653 1.0615 1.0627 1.0968 1.1019 1.1000 1.1013 1.0876 1.0937 1.0904 1.0863 1.0924 1.0953 1.0953 1.1014 1.0757
irintensity: 0.1130 0.5396 0.2154 0.4592 1.9654 1.8350 0.2746 1.6214 0.1095 1.0638 10.0026 0.6924 0.4889 1.8372 10.3095 3.2400 3.6792 3.4748 1.4042 4.0926 6.6138 8.2160 0.7908 6.5410 50.5438 39.0966 9.9277 35.7255 19.6639 65.6417 0.9668 9.0037 4.7559 6.4859 51.4484 44.5648 35.2246 17.2781 48.7603 41.1599 4.4920 29.0097 102.8761 43.0110 60.3101 0.4391 17.7107 34.6590 169.5399 0.0381 57.5949 126.4891 5.2005 5.9984 0.1574 4.9326 44.2207 14.4997 36.5223 20.8782 65.0707 14.1334 86.2010 14.9338 42.9126 42.4920 53.0661 21.2696 0.8244 3.1986 5.5483 43.6063 36.1216 39.6073 5.1862 13.1017 29.5729 152.8360 1.0957 4.7735 19.4234 6.1973 63.6575 1.0801 20.5909 22.2177 8.0369 56.5025 9.4821 6.5661 48.0894 16.1393 162.3262 12.6683 1.7760 6.0030 143.5615 44.6082 36.4016 37.5910 29.8621 17.6891 7.8444 37.7833 18.9287 13.0260 20.1495 8.5589 0.4183 26.5403 24.0012 4.4961 16.7205 24.8933
temp: 298.150 k
press: 1.00000 atm
elementType: 17 17 15 8 8 7 7 6 6 6 6 6 6 6 6 6 6 6 6 6 6 6 6 1 1 1 1 1 1 1 1 1 1 1 1 1 1 1 1 1
symmnumber: 1
zpe: 794457.9 jmol-1
zpe.correction: 0.302593 hartree
zpe.thermalcorrener: 0.324581 hartree
zpe.thermalcorrenthalpy: 0.325525 hartree
zpe.thermalcorrgfe: 0.247789 hartree
zpe.sumelectzpe: -2139.502670 hartree
zpe.sumelectthermal: -2139.480682 hartree
zpe.sumelectthermalent: -2139.479738 hartree
zpe.sumelectthermalfe: -2139.557473 hartree
dipole: -1.9662 -7.2232 2.3842
dipole: 7.8565
quadrupole: -158.6769 -145.2827 -157.7650
quadrupole: -4.6166 -3.6727 3.7771
quadrupole: -4.7687 8.6254 -3.8568 -4.6166 -3.6727 3.7771
hfenergy: -2139.8052628 hartree
pointgroup: C01 [X(C16H17Cl2N2O2P1)]
dipole: -0.4439827 -0.6734791 2.9838804 debye
polarizability: 322.6400118|17.8612092|174.9736983|0.8457194|-42.9495007|196.4287416 unknown
InChI: InChI=1S/C16H17Cl2N2O2P/c17-15-8-7-13(11-16(15)18)12-20-9-4-10-22-23(20,21)19-14-5-2-1-3-6-14/h1-3,5-8,11,19H,4,9-10,12H2
charge 0 multiplicity 1
40 atoms
Cl 3.756764 1.683166 -2.8653
Cl 6.403195 1.473989 -0.924558
P  -0.96297 -0.379403 -0.32893
O  -0.93406 1.361486 -0.155013
O  -0.673312 -0.795215 -1.835312
N  0.178338 -1.000795 0.831453
N  -2.462149 -0.852191 0.428526
C  0.315126 -0.267365 2.125215
C  0.409046 1.270545 1.957206
C  1.323552 -1.804858 0.328516
C  -0.827957 1.856543 1.249974
C  2.583919 -0.999243 0.014656
C  -3.775424 -0.445893 0.063641
C  2.608666 -0.142325 -1.116041
C  3.733885 -1.090568 0.835311
C  -4.880865 -0.980311 0.778164
C  -4.00307 0.477812 -0.990884
C  3.762626 0.609145 -1.407296
C  4.891076 -0.334511 0.544437
C  4.903762 0.517672 -0.577523
C  -6.195188 -0.592903 0.441839
C  -5.322385 0.858247 -1.313164
C  -6.426318 0.3302 -0.603873
H  1.22396 -0.647753 2.624007
H  -0.546244 -0.513321 2.779719
H  0.497531 1.737107 2.958289
H  1.315444 1.528302 1.380208
H  0.974384 -2.323942 -0.582632
H  1.549295 -2.574643 1.090584
H  -1.760426 1.602496 1.793854
H  -0.757108 2.950164 1.13859
H  -2.379869 -1.641603 1.073782
H  1.729585 -0.07244 -1.768906
H  3.737559 -1.761488 1.702587
H  -4.711234 -1.696602 1.592224
H  -3.161471 0.89047 -1.556903
H  5.781897 -0.403054 1.175613
H  -7.038963 -1.015201 0.999306
H  -5.486412 1.569012 -2.130786
H  -7.447083 0.628473 -0.864181
