program: Gaussian 09
title: 000265524
version: EM64L-G09RevD.01
frameworkgroup: C1[X(C13H11NO3)]
method: RPBEPBE
basis: SDD
operation: Freq
keyword: #p
keyword: freq=noraman
keyword: PBEPBE/SDD
title: #p freq=noraman PBEPBE/SDD
converged: YES YES NO NO
title: Mulliken charges:
elementType: O O O N C C C C C C C C C C C C C H H H H H H H H H H H
charge: -0.193073 -0.257452 -0.229741 -0.013895 0.411914 -0.073767 0.015943 -0.308096 -0.281253 0.149267 -0.384315 -0.584611 -0.318668 -0.240715 -0.217393 0.246906 -0.499336 0.249881 0.280318 0.274173 0.273779 0.240378 0.266557 0.235697 0.238037 0.231174 0.239061 0.249231
chargesum: 0.00000
title: Mulliken charges with hydrogens summed into heavy atoms:
elementType: O O O N C C C C C C C C C C C C C
charge: -0.193073 -0.257452 -0.229741 -0.013895 0.411914 -0.073767 0.015943 -0.058215 -0.000935 0.149267 -0.143937 -0.036660 -0.052111 -0.005018 0.020644 0.246906 0.220130
polarizability: 2.53109994e+02 2.42507352e+01 1.55747466e+02 4.21395838e+00 -1.24400676e+00 8.20985561e+01
1716.lowfreq: -5.6104 -2.2861 -0.0008 -0.0006 0.0003 5.9310 19.0281 32.6515 59.0285
frequency: 18.5330 32.6111 59.0237 68.7214 88.7183 95.3034 125.7431 179.0465 209.9667 239.0284 251.7312 264.6103 350.8992 378.2441 396.8499 452.0216 465.2887 481.9454 515.6210 550.5740 571.6099 606.9978 620.3884 651.4547 681.9972 752.6841 764.6698 778.9866 802.3734 815.2109 856.2483 875.5082 894.3759 918.8740 932.2524 971.9980 973.2586 1000.8509 1005.6483 1013.3126 1020.1401 1108.0890 1112.3803 1119.3733 1142.1257 1150.5592 1169.2782 1213.8167 1233.1832 1243.2394 1263.6055 1293.5427 1312.7748 1363.5466 1404.4647 1407.6893 1420.3798 1422.9750 1452.2928 1453.9116 1463.1124 1501.2675 1547.6685 1586.3784 1604.0401 1623.4570 1656.8511 3005.2708 3033.7388 3095.2107 3108.1283 3127.1621 3136.2041 3141.8880 3149.5819 3158.4623 3173.1263 3178.9722
redmass: 4.2520 4.8996 4.7278 4.3079 5.6433 1.2043 5.0599 4.1486 5.6962 5.3335 3.7890 4.5030 7.1124 2.5753 3.5520 5.2687 4.0271 2.9401 7.1508 8.6895 3.3639 7.5270 6.6001 5.3714 3.1896 5.6213 1.3910 3.8971 3.1369 5.2206 1.4281 6.2988 1.7327 4.6947 3.4072 1.4740 4.3503 1.3369 1.3611 2.9422 2.4718 1.7265 1.2703 1.6321 1.2106 1.4355 1.1074 1.7744 2.0933 2.0867 2.1915 2.6608 2.5194 3.8596 3.5848 1.2336 2.2481 1.1983 1.0501 3.1157 1.0509 3.6779 7.4831 6.4439 8.8579 6.5987 9.9371 1.0294 1.0606 1.0991 1.1046 1.0874 1.0907 1.0894 1.1048 1.0949 1.0998 1.0959
irintensity: 0.7154 2.4319 3.4422 0.9911 0.0816 0.3045 3.8603 5.8330 4.8518 0.5672 12.7550 6.4425 10.7054 3.8967 1.7108 8.0779 0.1757 11.2378 0.0928 11.3914 0.4303 4.9261 9.2112 21.4261 0.3161 5.3300 63.4809 1.8199 2.3198 0.9453 71.5273 0.7116 10.6947 36.5808 0.3353 10.5024 81.2516 0.1033 0.1598 7.9209 18.8411 36.0891 0.2350 109.8443 1.2241 5.7569 1.4993 108.6121 85.6340 38.8107 16.3493 1.6442 247.9814 8.2147 20.1588 19.7040 11.5854 31.9759 13.7053 23.5804 10.2715 3.8853 8.4742 23.5191 99.0365 5.5982 225.3109 36.5941 7.4794 0.4827 24.0009 2.0655 7.8753 11.0002 16.6228 20.6973 20.5670 4.9468
temp: 298.150 k
press: 1.00000 atm
elementType: 8 8 8 7 6 6 6 6 6 6 6 6 6 6 6 6 6 1 1 1 1 1 1 1 1 1 1 1
symmnumber: 1
zpe: 552142.8 jmol-1
zpe.correction: 0.210300 hartree
zpe.thermalcorrener: 0.225396 hartree
zpe.thermalcorrenthalpy: 0.226340 hartree
zpe.thermalcorrgfe: 0.165509 hartree
zpe.sumelectzpe: -781.210249 hartree
zpe.sumelectthermal: -781.195153 hartree
zpe.sumelectthermalent: -781.194209 hartree
zpe.sumelectthermalfe: -781.255040 hartree
dipole: -4.7453 -0.4683 -2.0214
dipole: 5.1791
quadrupole: -77.1211 -90.9349 -104.9513
quadrupole: -3.7837 -9.9730 0.4182
quadrupole: 13.8813 0.0675 -13.9488 -3.7837 -9.9730 0.4182
hfenergy: -781.420549 hartree
pointgroup: C01 [X(C13H11N1O3)]
dipole: 1.8541209 -0.252189 0.806575 debye
polarizability: 254.2481219|-22.1892111|152.4132403|4.5747443|11.6801251|84.2946538 unknown
InChI: InChI=1S/C13H11NO3/c1-17-13(16)8-12(15)11-7-6-9-4-2-3-5-10(9)14-11/h2-7H,8H2,1H3
charge 0 multiplicity 1
28 atoms
O  -2.236175 1.530976 -0.068245
O  -4.279403 -0.890869 0.638733
O  -4.307721 -0.696001 -1.683885
N  0.630976 -0.630605 -0.218286
C  2.740236 0.625425 0.16283
C  2.011146 -0.6016 -0.105857
C  -0.043587 0.532248 -0.070061
C  1.979675 1.832819 0.311068
C  0.592471 1.792104 0.195935
C  -1.546761 0.483112 -0.192395
C  4.166655 0.578859 0.267199
C  -2.164298 -0.892867 -0.472337
C  2.734208 -1.828351 -0.261168
C  4.846672 -0.632032 0.11209
C  4.126445 -1.841876 -0.153671
C  -3.671504 -0.817216 -0.61479
C  -5.753014 -0.726106 0.64372
H  2.499319 2.776343 0.513556
H  -0.03686 2.679945 0.299056
H  -1.718157 -1.298054 -1.396445
H  -1.875855 -1.57535 0.345951
H  4.717838 1.504784 0.469925
H  2.15979 -2.737394 -0.463623
H  5.938644 -0.662462 0.192777
H  4.67708 -2.781075 -0.272732
H  -6.039096 -0.789503 1.702755
H  -6.229858 -1.525946 0.052291
H  -6.022763 0.253494 0.215411
