program: Gaussian 09
title: 000265523
version: EM64L-G09RevD.01
frameworkgroup: C1[X(C18H16N4O3)]
method: RPBEPBE
basis: SDD
operation: Freq
keyword: #p
keyword: freq=noraman
keyword: PBEPBE/SDD
title: #p freq=noraman PBEPBE/SDD
converged: YES YES NO NO
title: Mulliken charges:
elementType: O O O N N N N C C C C C C C C C C C C C C C C C C H H H H H H H H H H H H H H H H
charge: -0.261952 -0.216298 -0.228315 -0.233585 -0.212361 -0.616213 -0.054259 -0.571748 -0.571607 0.265841 0.364685 0.220572 -0.093726 0.474638 0.491553 -0.347128 -0.458021 -0.378848 -0.390263 -0.230545 -0.219893 -0.233907 -0.235790 -0.234678 -0.236756 0.254552 0.290947 0.249674 0.261101 0.254550 0.248327 0.273863 0.258576 0.358776 0.365066 0.237460 0.235767 0.228131 0.225111 0.238420 0.228281
chargesum: 0.00000
title: Mulliken charges with hydrogens summed into heavy atoms:
elementType: O O O N N N N C C C C C C C C C C C C C C C C C C
charge: -0.261952 -0.216298 -0.228315 -0.233585 -0.212361 0.107630 -0.054259 -0.026248 -0.060833 0.265841 0.364685 0.220572 -0.093726 0.474638 0.491553 -0.092579 -0.209694 -0.104984 -0.131687 0.006915 0.015873 -0.005776 -0.010679 0.003742 -0.008475
polarizability: 2.64916325e+02 7.19074263e+00 2.44005242e+02 -1.46195685e+01 -8.60798216e+00 1.84168503e+02
1716.lowfreq: -11.2428 -6.7041 -0.0010 -0.0005 0.0004 2.0843 15.2248 20.2733 33.7507
frequency: 13.8981 19.6176 33.7121 42.9888 45.6840 55.7979 74.3104 92.1398 116.5254 178.6886 185.8799 195.7662 217.8560 234.6852 254.5207 263.9231 319.2276 339.4562 347.9322 355.2948 388.8564 402.5411 404.8270 412.4067 425.4241 440.3698 454.7561 501.7555 541.1795 548.2016 575.1018 603.5207 605.3800 616.5571 617.5518 659.2011 672.5078 703.2505 707.0214 707.8188 735.4515 746.7259 751.2432 769.8603 806.8102 812.3622 821.8526 858.7579 861.6256 866.9475 901.0493 924.5868 939.9289 960.7388 980.9579 982.7029 985.8192 989.6653 990.1515 1001.4645 1004.4576 1026.2523 1026.8895 1064.7232 1081.6478 1097.6337 1106.8575 1138.2494 1172.8350 1176.7933 1189.5102 1190.9122 1200.0738 1211.9192 1220.0946 1227.2829 1278.7895 1294.9838 1313.0094 1330.9258 1341.2398 1348.4403 1358.4166 1374.5965 1385.0300 1386.9932 1444.2991 1444.3852 1455.9528 1459.3933 1483.6465 1485.0905 1507.6394 1538.6909 1587.1849 1593.5237 1594.4311 1612.5199 1613.0779 1613.4630 1634.5460 3003.5967 3053.6057 3065.5276 3107.9224 3116.1560 3122.7717 3130.7379 3131.3730 3140.7401 3142.5224 3151.0147 3152.8597 3164.1840 3169.5311 3375.5196 3597.7164
redmass: 5.5241 4.4151 4.3739 5.9828 5.9924 5.0694 11.7920 6.4525 7.6096 6.4710 6.2018 5.0387 7.8243 5.7663 7.1057 6.8345 6.3730 5.5314 2.5350 4.3655 4.5627 2.8126 2.8433 4.7170 3.3036 5.0251 3.2897 4.8812 1.7949 2.1230 7.7218 5.2159 5.0989 6.3882 6.1953 5.8465 6.9436 4.6954 1.9527 2.3421 4.0590 4.6549 1.8104 2.6652 1.6839 1.9744 3.5070 1.2468 1.3042 2.5078 2.4150 1.7178 1.5679 2.8753 2.4926 1.3899 1.4006 5.9498 5.8385 1.3254 1.3416 2.2307 2.2457 2.4883 1.9097 1.8023 2.2866 2.0150 1.0541 1.0559 1.1303 1.1362 4.4653 2.8725 4.1322 3.4589 2.5173 1.6647 2.1766 1.3324 1.4169 3.0529 1.4740 1.9531 5.8552 4.3750 2.1085 2.1101 1.1429 1.1502 2.1985 2.1734 1.8252 4.6801 3.3939 5.5227 5.9735 6.0555 5.9725 5.9155 7.6149 1.0607 1.0586 1.1009 1.0891 1.1057 1.0847 1.0867 1.0881 1.0905 1.0927 1.0967 1.0957 1.1016 1.1014 1.0529 1.0966
irintensity: 0.3263 0.2684 0.1425 0.2844 0.5968 2.8542 0.9337 5.9532 2.0047 1.5965 1.8941 0.7896 0.0647 2.6693 1.0934 3.1568 12.5194 3.5550 1.1033 11.1228 6.1571 0.6547 0.1756 8.7653 5.2054 0.6313 3.2927 35.6120 84.1462 50.6485 25.7780 21.6739 19.9569 2.6488 0.6184 10.1924 5.8249 8.8301 43.3917 64.7713 6.0240 33.6338 38.0518 26.6902 53.0951 81.0913 13.4643 1.2377 4.1870 10.6384 20.3526 6.7878 2.0293 0.6583 9.8437 0.4273 1.2834 1.8980 0.0427 1.4562 0.3721 7.1089 7.3860 9.9444 11.4878 17.0083 19.0160 20.6119 0.0522 0.0878 7.9929 3.1041 14.0965 8.0117 39.1797 134.9181 230.5436 80.5479 180.8905 3.3284 31.6780 99.3229 22.0339 29.6407 2.6181 4.5876 6.8542 14.5128 51.9657 21.3670 22.3106 15.1886 23.5507 170.3858 366.0626 33.2023 0.4033 298.9342 14.1611 436.2264 66.3408 25.7788 16.4656 20.7499 9.1288 0.8330 0.2755 1.8092 6.0876 5.7681 15.0283 20.8931 24.4286 22.5398 18.1998 64.3416 213.1111
temp: 298.150 k
press: 1.00000 atm
elementType: 8 8 8 7 7 7 7 6 6 6 6 6 6 6 6 6 6 6 6 6 6 6 6 6 6 1 1 1 1 1 1 1 1 1 1 1 1 1 1 1 1
symmnumber: 1
zpe: 821278.3 jmol-1
zpe.correction: 0.312808 hartree
zpe.thermalcorrener: 0.334068 hartree
zpe.thermalcorrenthalpy: 0.335012 hartree
zpe.thermalcorrgfe: 0.259489 hartree
zpe.sumelectzpe: -1138.410296 hartree
zpe.sumelectthermal: -1138.389036 hartree
zpe.sumelectthermalent: -1138.388092 hartree
zpe.sumelectthermalfe: -1138.463616 hartree
dipole: -6.8269 -4.9174 1.1471
dipole: 8.4914
quadrupole: -123.0718 -164.9330 -143.4334
quadrupole: -11.3941 0.1250 17.9119
quadrupole: 20.7409 -21.1203 0.3793 -11.3941 0.1250 17.9119
hfenergy: -1138.7231042 hartree
pointgroup: C01 [X(C18H16N4O3)]
dipole: -2.7440808 1.8628506 -0.4006353 debye
polarizability: 266.8028049|-6.692892|242.2895071|9.6012905|-12.2321435|183.9977583 unknown
InChI: InChI=1S/C18H16N4O3/c19-16-15(20-25)17(23)22(12-14-9-5-2-6-10-14)18(24)21(16)11-13-7-3-1-4-8-13/h1-10H,11-12,19H2
charge 0 multiplicity 1
41 atoms
O  0.114066 0.719049 -2.275001
O  2.433982 -2.55473 0.144478
O  0.711812 -4.17566 1.817426
N  -1.12353 -0.700942 -0.881778
N  1.268068 -0.899734 -1.037813
N  -2.361756 -2.115159 0.56885
N  -0.248296 -3.438932 1.371115
C  -2.371422 -0.055143 -1.379919
C  2.575481 -0.38911 -1.572349
C  0.117024 -0.23715 -1.449417
C  -1.170798 -1.731585 0.038734
C  1.31939 -2.031334 -0.11863
C  0.02215 -2.426514 0.423585
C  -3.13422 0.730067 -0.316943
C  3.152038 0.739045 -0.724056
C  -2.462301 1.654303 0.522347
C  -4.537072 0.570827 -0.189571
C  3.929169 0.44273 0.426037
C  2.924306 2.093574 -1.077657
C  -3.183987 2.402516 1.476548
C  -5.261239 1.325339 0.762927
C  4.465107 1.486903 1.21207
C  3.462702 3.137427 -0.291439
C  -4.584724 2.240067 1.600769
C  4.233833 2.836575 0.855552
H  -3.015245 -0.83419 -1.829919
H  -2.034163 0.620542 -2.185377
H  2.386364 -0.050423 -2.603016
H  3.25027 -1.259883 -1.578816
H  -1.37902 1.791376 0.424585
H  -5.069511 -0.128062 -0.84873
H  4.102729 -0.604567 0.699043
H  2.319118 2.321438 -1.962564
H  -3.203417 -1.543147 0.508383
H  -2.272963 -2.889864 1.243007
H  -2.656811 3.114379 2.120834
H  -6.345719 1.19801 0.849815
H  5.065675 1.24893 2.09721
H  3.285641 4.181333 -0.574447
H  -5.141925 2.822719 2.342169
H  4.654495 3.645781 1.463461
