program: Gaussian 09
title: 000265522
version: EM64L-G09RevD.01
frameworkgroup: C1[X(C20H19N)]
method: RPBEPBE
basis: SDD
operation: Freq
keyword: #pfreq=noraman
keyword: PBEPBE/SDD
title: #p freq=noraman PBEPBE/SDD
converged: YES YES NO YES
title: Mulliken charges:
elementType: N C C C C C C C C C C C C C C C C C C C C H H H H H H H H H H H H H H H H H H H
charge: -0.121370 -0.018555 -0.489602 -0.580158 -0.382831 -0.436095 -0.482929 0.038793 -0.049263 0.287805 0.287192 0.205094 0.202505 -0.406330 -0.411028 -0.386126 -0.383730 -0.281880 -0.278514 -0.271384 -0.273196 0.217899 0.206088 0.225058 0.236351 0.208941 0.224767 0.175203 0.225374 0.209137 0.190306 0.238190 0.252286 0.251447 0.228590 0.228740 0.228103 0.227846 0.228538 0.228735
chargesum: 0.00000
title: Mulliken charges with hydrogens summed into heavy atoms:
elementType: N C C C C C C C C C C C C C C C C C C C C
charge: -0.121370 0.199344 -0.058456 -0.134865 0.017140 -0.001584 -0.054432 0.038793 -0.049263 0.287805 0.287192 0.205094 0.202505 -0.154044 -0.159581 -0.157536 -0.154990 -0.053777 -0.050668 -0.042846 -0.044461
polarizability: 2.79282106e+02 -1.08199609e+00 2.98614882e+02 -1.49134000e-01 1.39852716e+00 1.07699215e+02
1716.lowfreq: -8.2674 -7.0257 -0.0001 0.0005 0.0005 7.3606 49.2155 57.2680 73.0877
frequency: 49.1362 57.1678 73.0332 98.7965 121.5702 148.5900 171.8568 196.3423 232.4074 260.3898 273.6391 303.4092 314.8084 339.3982 407.0158 429.2690 435.9584 447.8858 489.1952 535.1211 545.1990 548.8391 565.9372 602.8130 618.0342 625.5147 643.9756 671.4788 681.6936 735.1159 743.9123 763.2692 765.6758 777.1870 811.0623 816.1577 867.0071 880.6977 883.1079 904.9749 920.2261 950.3031 953.0996 963.1336 965.4662 984.1837 989.0102 991.2083 999.3850 1020.6939 1031.0939 1049.3738 1054.9404 1079.5262 1093.6356 1107.7763 1110.6307 1150.8581 1157.5226 1166.8725 1177.0207 1186.2566 1187.9589 1213.9294 1227.7261 1230.1725 1246.0858 1254.8221 1262.6945 1273.2747 1284.4762 1293.0875 1305.0492 1311.8359 1325.4829 1334.7084 1351.5068 1364.7904 1383.7884 1393.0373 1407.4524 1434.9828 1441.6245 1446.9653 1457.1212 1464.5592 1468.8580 1480.6413 1492.3014 1498.3686 1537.2913 1581.2694 1601.7766 1616.7576 1619.1014 2784.1848 2805.9424 2837.4050 2966.3966 2992.2639 3005.9723 3020.6384 3023.5212 3032.9050 3062.5382 3088.8216 3126.5853 3127.9357 3140.6154 3144.8840 3155.7515 3161.3322 3167.8341 3171.0531
redmass: 3.1449 2.7417 2.2921 3.9435 2.9707 4.1072 3.6796 2.3696 4.7826 2.4684 3.4966 4.2749 5.3702 3.6454 6.3648 2.8674 3.1909 4.8043 2.4008 3.4505 4.4686 4.9532 3.3799 4.5631 6.1584 3.2953 3.4175 4.3407 5.3395 2.4966 2.6059 1.5430 1.5171 2.6971 1.6731 1.9787 1.4271 2.3671 2.2344 2.7112 2.7253 1.4504 1.4503 4.2059 1.6092 1.3623 1.4442 5.0688 2.1105 3.0987 2.3837 1.8757 2.3414 3.1026 2.2300 2.4434 2.3695 2.3037 1.2935 1.4797 1.2987 1.1479 1.2263 1.3577 1.1540 1.9540 1.5344 1.5093 1.4246 2.1480 1.4819 1.3321 1.4859 1.4125 2.3564 1.4450 1.8336 1.9599 2.3192 5.7897 4.3412 1.8887 2.7084 1.3380 2.5009 1.1125 1.1618 1.1007 1.2335 2.0681 3.6182 7.6382 7.3415 5.8597 6.2518 1.0717 1.0792 1.0718 1.0606 1.0842 1.0593 1.0703 1.0985 1.0806 1.1039 1.1052 1.0847 1.0851 1.0893 1.0894 1.0946 1.0927 1.0993 1.0978
irintensity: 0.2289 0.1069 0.0649 0.7075 0.3970 1.1849 2.0226 1.1759 0.1232 8.8661 0.5767 1.0783 1.1055 0.6633 1.3276 0.0609 5.0077 1.3943 1.0998 3.4129 0.7596 1.4684 0.2722 0.8485 3.6801 0.5722 0.1706 2.0100 0.7008 44.2383 0.2427 114.0230 14.7793 0.3409 0.7210 12.0684 0.1020 5.4207 1.3204 0.9877 1.0802 0.0881 1.2042 3.9199 0.6301 0.5327 0.3660 2.1713 6.1633 2.8476 1.7676 11.0602 5.9442 2.4661 2.2192 2.6158 10.5038 11.3042 21.7760 3.6186 6.4025 2.0875 4.9155 10.4555 1.7077 20.0221 3.1259 7.9331 20.0221 8.5617 5.4975 3.5764 1.7092 5.8389 1.1981 2.4526 2.7963 6.7422 11.9373 0.2809 3.3089 8.3861 3.4325 6.5493 10.8046 7.1627 2.7022 15.4351 7.9970 17.8675 0.2565 0.3889 13.0725 2.4257 3.6990 55.9403 67.6244 165.6144 24.7129 24.3911 27.0200 43.3763 26.8138 70.0733 5.2962 64.5274 0.2759 0.8390 21.2004 10.4767 1.4287 42.7246 56.1721 18.6162
temp: 298.150 k
press: 1.00000 atm
elementType: 7 6 6 6 6 6 6 6 6 6 6 6 6 6 6 6 6 6 6 6 6 1 1 1 1 1 1 1 1 1 1 1 1 1 1 1 1 1 1 1
symmnumber: 1
zpe: 876557.3 jmol-1
zpe.correction: 0.333863 hartree
zpe.thermalcorrener: 0.349803 hartree
zpe.thermalcorrenthalpy: 0.350747 hartree
zpe.thermalcorrgfe: 0.290639 hartree
zpe.sumelectzpe: -826.832596 hartree
zpe.sumelectthermal: -826.816656 hartree
zpe.sumelectthermalent: -826.815712 hartree
zpe.sumelectthermalfe: -826.875820 hartree
dipole: -1.0528 0.0735 0.7488
dipole: 1.2941
quadrupole: -107.6575 -110.3036 -130.5457
quadrupole: -0.2056 -2.1876 0.0459
quadrupole: 8.5114 5.8653 -14.3768 -0.2056 -2.1876 0.0459
hfenergy: -827.1664595 hartree
pointgroup: C01 [X(C20H19N1)]
dipole: 0.413369 -0.0281196 0.2958718 debye
polarizability: 279.2785085|-1.0630138|298.6037869|0.6321353|-2.086745|107.7139076 unknown
InChI: InChI=1S/C20H19N/c1-3-9-17-15(7-1)16-8-2-4-10-18(16)20-13-21-11-5-6-14(21)12-19(17)20/h1-4,7-10,14H,5-6,11-13H2
charge 0 multiplicity 1
40 atoms
N  2.941197 -0.583155 -0.333847
C  2.950276 0.644208 0.494644
C  4.358387 1.234489 0.233966
C  1.757416 1.519547 0.093112
C  4.271191 -1.207105 -0.166603
C  5.244575 0.00508 -0.168861
C  1.788772 -1.447983 -0.061258
C  0.456771 0.721267 0.026679
C  0.47494 -0.671044 -0.011234
C  -0.814192 1.439208 -0.00705
C  -0.770592 -1.430772 0.008935
C  -2.061835 0.716645 -0.018581
C  -2.039893 -0.747291 0.013397
C  -0.849553 2.87012 -0.049825
C  -0.761582 -2.862896 0.03968
C  -3.281477 1.459102 -0.062142
C  -3.236197 -1.527666 0.04488
C  -2.059674 3.573001 -0.095341
C  -1.949716 -3.60275 0.071094
C  -3.289295 2.859447 -0.09801
C  -3.200975 -2.927627 0.072328
H  2.853755 0.380639 1.58284
H  4.747504 1.758917 1.123991
H  4.311829 1.964085 -0.594186
H  1.965656 1.976283 -0.89596
H  1.654797 2.349553 0.818822
H  4.475444 -1.927676 -0.979198
H  4.344619 -1.760271 0.806508
H  5.673678 0.155735 -1.173852
H  6.081972 -0.154466 0.5325
H  1.913687 -2.006124 0.908836
H  1.732246 -2.215316 -0.857893
H  0.088337 3.432177 -0.060901
H  0.191633 -3.399272 0.048993
H  -4.239917 0.932407 -0.073666
H  -4.210561 -1.030894 0.051653
H  -2.059451 4.667925 -0.132395
H  -1.915968 -4.697475 0.09749
H  -4.240184 3.402246 -0.133206
H  -4.134721 -3.499897 0.097361
