program: Gaussian 09
title: 000024534
version: EM64L-G09RevD.01
frameworkgroup: C1[X(H2N2O2)]
method: RPBEPBE
basis: SDD
operation: Freq
keyword: #p
keyword: freq=noraman
keyword: PBEPBE/SDD
title: #p freq=noraman PBEPBE/SDD
converged: NO NO NO NO
title: Mulliken charges:
elementType: O O N N H H
charge: -0.217772 -0.217775 0.190993 -0.464767 0.354660 0.354660
chargesum: 0.00000
title: Mulliken charges with hydrogens summed into heavy atoms:
elementType: O O N N
charge: -0.217772 -0.217775 0.190993 0.244553
polarizability: 3.06821091e+01 -1.76251544e-04 3.26282770e+01 1.28203922e-02 4.22605130e-06 8.43273362e+00
1716.lowfreq: -31.3331 -24.3729 -21.7667 -0.0011 0.0004 0.0005 253.2951 481.9436 503.9304
frequency: 253.2943 481.9387 503.9270 616.6820 683.7738 952.4627 1087.6765 1250.1057 1461.1201 1544.9551 3519.4510 3717.6626
redmass: 1.2315 1.0484 2.9652 10.0469 11.4367 8.6104 1.6981 12.5006 5.3745 1.1146 1.0385 1.1138
irintensity: 429.0807 0.0612 0.0441 6.2391 2.2415 12.9230 25.8556 313.1147 206.0785 68.3343 67.0837 74.8384
temp: 298.150 k
press: 1.00000 atm
elementType: 8 8 7 7 1 1
symmnumber: 1
zpe: 96138.2 jmol-1
zpe.correction: 0.036617 hartree
zpe.thermalcorrener: 0.040755 hartree
zpe.thermalcorrenthalpy: 0.041699 hartree
zpe.thermalcorrgfe: 0.010380 hartree
zpe.sumelectzpe: -260.719583 hartree
zpe.sumelectthermal: -260.715445 hartree
zpe.sumelectthermalent: -260.714501 hartree
zpe.sumelectthermalfe: -260.745820 hartree
dipole: -4.6412 -0.0002 0.0565
dipole: 4.6415
quadrupole: -19.2857 -24.7199 -23.0356
quadrupole: 0.0002 -0.1065 0.0000
quadrupole: 3.0614 -2.3728 -0.6885 0.0002 -0.1065 0.0000
hfenergy: -260.7562003 hartree
pointgroup: C01 [X(H2N2O2)]
dipole: 0.0037457 -1.7949031 -0.3361087 debye
dipolederiv: -0.8239494 -0.2347059 -0.0393643 -0.146025 -0.551857 -0.054648 -0.0244939 -0.0550839 -0.2459001 -0.8255221 0.233562 0.039583 0.1448853 -0.5502741 -0.0544811 0.0247153 -0.0549778 -0.2459012 1.4633712 -0.0008266 -0.0005556 -0.0008274 1.8606583 0.2708713 -0.0005652 0.2753446 0.3246751 -0.2088978 0.0019563 0.0001446 0.0019521 -1.1466108 -0.0680546 0.0001299 -0.0611975 -0.7278674 0.1972546 0.071725 0.0105142 0.0454133 0.1942852 -0.0468219 0.0050314 -0.052032 0.4474966 0.1977435 -0.0717108 -0.0103219 -0.0453983 0.1937983 -0.0468657 -0.0048175 -0.0520535 0.4474969 unknown
polarizability: 32.6282662|0.0052969|30.0276922|-0.0076935|3.7593132|9.0871612 unknown
InChI: InChI=1S/H2N2O2/c1-2(3)4/h1H2
charge 0 multiplicity 1
6 atoms
O  1.152142 0.679095 0.05788
O  -1.154933 0.674299 0.057866
N  -0.000215 0.110652 -0.040914
N  0.002638 -1.258722 -0.276275
H  -0.90242 -1.714947 -0.369583
H  0.909589 -1.711176 -0.369574
