program: Gaussian 09
title: 000265470
version: EM64L-G09RevD.01
frameworkgroup: C1[X(C9H9ClFNO)]
method: RPBEPBE
basis: SDD
operation: Freq
keyword: #p
keyword: freq=noraman
keyword: PBEPBE/SDD
title: #p freq=noraman PBEPBE/SDD
converged: YES YES NO NO
title: Mulliken charges:
elementType: Cl F O N C C C C C C C C C H H H H H H H H H
charge: -0.081107 -0.203073 -0.282614 -0.380223 -0.329235 0.315604 0.181305 -0.495763 -0.367407 -0.554608 0.350276 -0.194837 -0.370015 0.269672 0.248257 0.318102 0.301923 0.223178 0.270767 0.280661 0.237181 0.261955
chargesum: 0.00000
title: Mulliken charges with hydrogens summed into heavy atoms:
elementType: Cl F O N C C C C C C C C C
charge: -0.081107 -0.203073 -0.282614 -0.062121 0.188694 0.315604 0.181305 -0.193840 -0.144229 -0.003180 0.350276 0.042344 -0.108060
polarizability: 1.58143793e+02 2.58825841e+00 1.27455932e+02 3.26649901e+00 -3.23616888e+00 5.74524597e+01
1716.lowfreq: -3.7681 -0.0030 -0.0006 0.0014 1.0572 8.3079 22.4045 41.3610 53.0407
frequency: 22.1924 41.3322 53.0264 85.8495 134.0185 171.9049 226.6905 245.4262 280.6443 339.2483 385.3133 417.7810 448.5449 481.2846 516.1718 546.1957 589.9256 603.7195 652.5524 678.7013 730.8878 762.9347 797.7413 826.8330 896.1026 911.8955 921.0576 972.1574 980.2796 987.7386 1017.0473 1076.3723 1086.6887 1125.6422 1159.5521 1182.2005 1192.2950 1226.9117 1262.2090 1288.5916 1299.2147 1363.2868 1390.9469 1428.6539 1440.6173 1453.8451 1466.3367 1500.9019 1577.8114 1606.2319 1616.3016 2994.5482 3052.3533 3067.5746 3131.6532 3155.5773 3156.9059 3177.0016 3181.5525 3557.6424
redmass: 7.5293 10.2260 6.4677 3.3737 6.8470 4.7632 5.1933 9.1806 3.9863 2.6653 7.5558 3.6062 3.0782 4.4908 5.8199 5.1133 2.6306 1.5364 6.8241 2.7860 2.9837 4.5790 1.6398 2.2959 1.4204 2.8519 1.5371 1.3568 2.3491 5.7620 1.6159 2.0083 1.6816 2.3242 1.3454 1.2024 2.3285 1.2936 1.8857 1.3248 1.4047 1.3564 9.7082 2.9619 1.1046 1.1088 2.2558 2.1585 6.9920 7.3447 6.9394 1.0593 1.0972 1.0619 1.0884 1.1121 1.0927 1.0928 1.0978 1.0772
irintensity: 1.5127 1.9216 10.6571 2.2247 3.2127 4.9239 0.7606 4.4838 1.5644 15.2479 12.5909 3.0255 5.2714 1.6472 5.6166 15.5318 26.7749 96.1526 3.0771 14.7349 59.6242 8.1487 41.0864 45.5240 0.9794 30.9478 21.1782 0.4102 18.4522 0.3907 1.3154 3.8648 8.4225 13.5789 1.2629 0.6539 20.4615 25.2863 153.1899 13.3324 98.2874 4.7547 1.0998 4.8832 8.7154 46.3154 119.4399 253.0495 165.9985 33.8839 6.8478 45.0721 6.0037 23.4408 8.4379 13.7028 10.9108 3.8460 5.7425 23.0406
temp: 298.150 k
press: 1.00000 atm
elementType: 17 9 8 7 6 6 6 6 6 6 6 6 6 1 1 1 1 1 1 1 1 1
symmnumber: 1
zpe: 430324.4 jmol-1
zpe.correction: 0.163902 hartree
zpe.thermalcorrener: 0.176173 hartree
zpe.thermalcorrenthalpy: 0.177117 hartree
zpe.thermalcorrgfe: 0.122732 hartree
zpe.sumelectzpe: -1037.301507 hartree
zpe.sumelectthermal: -1037.289236 hartree
zpe.sumelectthermalent: -1037.288292 hartree
zpe.sumelectthermalfe: -1037.342677 hartree
dipole: -2.0422 2.4259 -0.4094
dipole: 3.1974
quadrupole: -85.7221 -83.4481 -83.2483
quadrupole: 14.8002 -0.7891 1.1269
quadrupole: -1.5826 0.6914 0.8912 14.8002 -0.7891 1.1269
hfenergy: -1037.4654091 hartree
pointgroup: C01 [X(C9H9Cl1F1N1O1)]
dipole: -0.7012399 1.0346142 -0.1422579 debye
dipolederiv: -0.2939716 0.0568709 0.022063 0.1888715 -0.5369362 0.0090614 0.0068743 0.0715189 -0.2130912 -0.9270267 0.369915 0.0119096 0.4524675 -0.4402281 -0.012165 0.021184 -0.013386 -0.1537094 -0.7742743 -0.1220031 -0.0296177 0.0942486 -0.9499643 0.1429437 -0.1082827 0.1016928 -0.3975877 -1.3366909 0.2361844 -0.1131741 0.2502108 -0.4603596 -0.0149963 -0.1242532 -0.0285642 -0.4945433 0.5640872 0.0313381 0.0606064 0.4266899 -0.0934273 0.0784204 0.0012151 0.0886735 0.2244718 -0.2630988 -0.1666686 -0.0212357 -0.1951859 -0.0049545 0.0190085 0.0137114 0.0265876 0.0018382 1.7285423 -0.0078688 0.2384588 -0.2399697 1.1133256 -0.2570636 0.3357274 -0.1942783 0.3095093 -0.2702779 0.1672953 0.0072956 -0.1335595 -0.0461723 0.0048237 0.0180725 -0.0026838 -0.1204134 -0.0572083 -0.077132 -0.0218365 -0.0052805 -0.1007875 0.0124995 -0.0690169 -0.0053516 -0.1659283 0.184787 -0.121425 0.0089417 -0.2781852 0.725438 -0.1234839 0.0008823 -0.0933017 0.1717361 1.0749435 -0.468041 -0.0149134 -0.5354767 0.4721107 0.0154656 -0.0241347 0.0158388 0.0976369 -0.016644 0.0217155 0.0030053 0.0068411 0.1578689 0.0245458 0.0014954 0.0225525 -0.1293701 -0.0822018 0.0264573 0.0017645 0.1581456 -0.1501801 0.0012723 0.0107505 0.0014706 -0.154702 0.1613552 0.0822368 0.0098056 -0.1036764 0.0306399 0.0254181 0.076288 0.0014711 0.1093771 -0.0945175 -0.0071213 -0.0581663 -0.0450161 0.1314503 0.0205334 -0.0818361 -0.0365502 -0.1018601 0.2663847 -0.0211172 -0.0309195 -0.1019643 0.1230687 0.05004 -0.035538 0.0551116 0.3111132 0.1672526 -0.0169731 -0.0000543 0.0290118 0.053413 -0.0106104 -0.0165732 -0.0040409 0.1782423 -0.0566085 0.0902154 0.0069296 0.094074 0.0576371 -0.0094974 0.0180585 0.0008049 0.1527164 -0.1309199 -0.0381726 -0.000087 -0.0196409 -0.0417789 0.0299679 -0.0015479 0.0086269 0.1046307 0.1018011 0.0224899 -0.0753875 0.0424054 -0.0320803 0.0217172 -0.0332997 0.0115105 -0.0678053 0.0747266 -0.0069876 -0.0000392 -0.0302316 -0.0940729 -0.0200137 -0.000704 -0.0206246 0.1561815 -0.0204402 -0.0512085 -0.0053491 -0.0547795 0.08599 -0.0078873 -0.0090731 -0.0070785 0.1815571 unknown
polarizability: 158.2651954|-0.6058257|127.387807|4.1352075|-1.705473|57.3991824 unknown
InChI: InChI=1S/C9H9ClFNO/c10-4-5-12-9(13)7-2-1-3-8(11)6-7/h1-3,6,12H,4-5H2
charge 0 multiplicity 1
22 atoms
Cl -4.382427 1.764281 -0.132238
F  4.17877 -1.010533 -0.098545
O  -0.789727 -2.120998 0.118943
N  -1.844449 -0.149474 -0.519794
C  -3.180166 -0.748536 -0.563181
C  0.581581 -0.123842 -0.095502
C  -0.724702 -0.879139 -0.14913
C  1.766366 -0.900734 -0.118991
C  0.670235 1.29027 0.003946
C  -4.162885 -0.056731 0.380076
C  3.000254 -0.240152 -0.065974
C  1.932726 1.921743 0.061466
C  3.120996 1.158516 0.020336
H  -3.062447 -1.805214 -0.254913
H  -3.578535 -0.735809 -1.595437
H  -1.761809 0.831305 -0.791407
H  1.698141 -1.991266 -0.168227
H  -0.23109 1.909444 0.076166
H  -5.170504 -0.493556 0.321254
H  -3.799506 -0.021106 1.416884
H  1.995025 3.011323 0.146687
H  4.110053 1.623408 0.062284
