program: Gaussian 09
title: 000265465
version: EM64L-G09RevD.01
frameworkgroup: C1[X(C2H3N3S)]
method: RPBEPBE
basis: SDD
operation: Freq
keyword: #pfreq=noraman
keyword: PBEPBE/SDD
title: #p freq=noraman PBEPBE/SDD
converged: NO NO NO NO
title: Mulliken charges:
elementType: S N N N C C H H H
charge: 0.272830 -0.641652 -0.045108 -0.211072 0.352634 -0.674226 0.288175 0.335547 0.322872
chargesum: 0.00000
title: Mulliken charges with hydrogens summed into heavy atoms:
elementType: S N N N C C
charge: 0.272830 0.016767 -0.045108 -0.211072 0.352634 -0.386051
polarizability: 8.15180777e+01 -5.67587564e+00 6.33224169e+01 -2.76526247e-03 2.12141391e-03 2.35738105e+01
1716.lowfreq: -24.1264 -14.3633 -3.3580 -0.0026 -0.0022 0.0019 195.9734 257.5871 314.5941
frequency: 195.9618 257.5849 314.5924 331.7357 371.0724 456.3606 566.5862 658.2302 736.8159 737.0785 829.6499 901.9097 1019.3690 1164.3810 1319.2975 1378.3695 1566.7903 1618.8709 3242.4383 3588.3323 3736.1394
redmass: 1.2478 4.2713 1.1119 4.6785 6.3304 5.0874 8.4970 4.8788 1.4918 9.2750 5.4279 3.6678 1.4857 1.6718 3.8772 9.6608 3.1407 1.4620 1.0938 1.0450 1.1051
irintensity: 38.6656 47.8566 282.0138 10.6602 45.1916 1.9389 0.6998 2.4881 82.3569 11.6306 5.9688 19.6240 12.2960 4.3227 47.0103 114.1360 131.9220 289.1413 6.6624 88.0115 44.9062
temp: 298.150 k
press: 1.00000 atm
elementType: 16 7 7 7 6 6 1 1 1
symmnumber: 1
zpe: 149482.8 jmol-1
zpe.correction: 0.056935 hartree
zpe.thermalcorrener: 0.062902 hartree
zpe.thermalcorrenthalpy: 0.063846 hartree
zpe.thermalcorrgfe: 0.027395 hartree
zpe.sumelectzpe: -639.837006 hartree
zpe.sumelectthermal: -639.831039 hartree
zpe.sumelectthermalent: -639.830095 hartree
zpe.sumelectthermalfe: -639.866546 hartree
dipole: -3.4517 -3.1702 -0.0005
dipole: 4.6866
quadrupole: -34.0413 -42.2132 -44.5577
quadrupole: 0.9319 -0.0018 -0.0011
quadrupole: 6.2294 -1.9424 -4.2870 0.9319 -0.0018 -0.0011
hfenergy: -639.893941 hartree
pointgroup: C01 [X(C2H3N3S1)]
dipole: 1.5575041 -0.9869113 0.0001827 debye
dipolederiv: -0.1573879 -0.399242 -0.0000274 -0.2856646 -0.5117928 0.0001402 0.0003922 0.0003145 0.1465291 -1.3992621 -0.1782474 -0.0000335 -0.0610414 -0.0917768 0.000098 -0.0000243 0.0000837 -0.7637943 -0.8412891 -1.0666275 0.0000391 -0.0224116 -0.1410141 0.0001681 -0.0000724 -0.000486 -0.0844829 0.3522439 1.0820713 0.0000884 0.4531947 0.5098265 -0.0003684 -0.0001456 0.0001926 -0.2042948 1.646539 0.3313069 -0.000043 0.1769308 -0.1146115 -0.0000161 0.0000896 0.0000141 0.204895 -0.1424263 0.1240399 -0.0000801 -0.3290931 -0.0383416 0.0000652 -0.0002056 -0.0000505 -0.3950198 0.0776536 0.0714727 0.0000373 0.0647836 0.0661809 -0.0000046 -0.0000594 0.000011 0.2601707 0.2363299 0.053791 0.0000168 0.0502784 0.1882648 -0.0000363 -0.0000147 -0.0000075 0.4189613 0.227599 -0.018565 0.0000024 -0.0469768 0.1332647 -0.0000461 0.0000402 -0.0000719 0.4170358 unknown
polarizability: 78.9672707|8.4925007|65.8732239|-0.0023456|-0.0025778|23.5738105 unknown
InChI: InChI=1S/C2H3N3S/c3-2-1-6-5-4-2/h1H,3H2
charge 0 multiplicity 1
9 atoms
S  -1.75511 -0.857739 0.000262
N  2.169431 -0.016105 -0.000028
N  0.05164 1.102954 0.000181
N  -1.233354 1.055612 -0.000472
C  0.784975 -0.098443 0.000001
C  -0.032397 -1.236331 -0.000171
H  0.30783 -2.26952 -0.000279
H  2.606672 0.900205 0.000121
H  2.745814 -0.849532 -0.000216
