program: Gaussian 09
title: 000265445
version: EM64L-G09RevD.01
frameworkgroup: C1[X(C10H10N2O3)]
method: RPBEPBE
basis: SDD
operation: Freq
keyword: #p
keyword: freq=noraman
keyword: PBEPBE/SDD
title: #p freq=noraman PBEPBE/SDD
converged: YES YES NO NO
title: Mulliken charges:
elementType: O O O N N C C C C C C C C C C H H H H H H H H H H
charge: -0.193870 -0.261904 -0.229678 -0.412694 -0.398162 -0.323040 0.530465 0.176008 -0.397015 -0.382262 0.182406 -0.349387 -0.348998 0.322232 -0.537977 0.267550 0.331785 0.235988 0.245523 0.350917 0.253987 0.243642 0.224582 0.221520 0.248382
chargesum: 0.00000
title: Mulliken charges with hydrogens summed into heavy atoms:
elementType: O O O N N C C C C C C C C C C
charge: -0.193870 -0.261904 -0.229678 -0.080909 -0.047245 -0.055490 0.530465 0.176008 -0.161027 -0.136738 0.182406 -0.095400 -0.105357 0.322232 0.156507
polarizability: 1.80064652e+02 -9.40793908e+00 1.23627210e+02 -5.31918066e-01 -7.54532859e+00 8.46137539e+01
1716.lowfreq: -4.3950 -0.0008 -0.0005 0.0004 5.0470 10.6524 25.2946 52.5894 56.8194
frequency: 25.0792 52.5764 56.8141 105.8956 154.6145 169.3500 181.4180 238.2027 270.6360 278.6426 353.4632 382.0003 414.5561 464.2416 478.7148 505.3845 521.4801 557.7748 603.4800 620.9745 633.1539 665.0244 703.8920 719.3499 735.1164 764.8857 815.3399 825.9361 848.7001 894.2408 949.0778 961.3955 964.5696 986.3653 1002.3392 1070.1494 1112.5147 1118.0638 1157.6567 1174.5770 1179.7006 1205.2682 1216.2038 1236.1477 1277.9193 1308.0543 1315.3438 1333.7349 1366.6290 1392.8607 1422.2222 1437.3345 1468.5431 1472.6423 1502.9835 1587.3548 1623.8811 1687.4618 1724.7856 2962.1117 2986.8947 3051.2520 3128.4458 3131.6552 3132.9802 3166.2720 3171.3942 3589.3517 3611.7686
redmass: 4.3492 7.7389 4.8672 4.0993 7.1288 3.8975 5.2389 1.2522 5.5289 4.0118 6.6554 8.4597 2.9131 4.4707 1.7970 2.1675 2.5055 3.6658 11.9187 4.0130 2.5311 1.9214 5.3027 7.6690 4.0445 5.3304 1.6704 1.5999 2.9596 4.3886 1.5043 2.8225 1.3789 8.6592 2.6923 2.4016 1.2607 1.3599 1.3341 3.1609 1.2267 2.5249 1.7545 3.7548 1.6623 1.6038 1.5149 3.3323 1.7581 3.8831 3.2252 1.1777 1.0498 1.0758 2.4497 7.0211 6.3528 8.5182 9.6428 1.0329 1.0836 1.1041 1.0991 1.0898 1.0894 1.0938 1.0955 1.0802 1.0803
irintensity: 0.9861 0.0974 1.2183 4.9488 3.8458 3.3311 3.0985 0.2919 0.1626 1.2642 4.0503 20.5915 1.9982 1.5808 76.9464 41.0592 15.6651 41.7672 14.6616 21.0491 67.7514 71.4557 16.2045 63.3228 5.3172 5.8275 26.0598 12.2470 28.7628 18.6614 1.8859 21.7615 0.4624 41.9586 7.4867 17.5795 0.2366 12.6248 2.0169 82.9565 71.9033 64.3563 60.6203 164.6720 54.5296 24.7396 19.3249 138.9130 10.8622 23.4924 2.9447 9.7738 14.0613 55.3563 103.9308 13.7679 71.6287 574.5810 387.1077 61.4313 15.9381 46.5385 27.1257 6.3520 8.3489 11.5388 3.9763 71.3485 46.4746
temp: 298.150 k
press: 1.00000 atm
elementType: 8 8 8 7 7 6 6 6 6 6 6 6 6 6 6 1 1 1 1 1 1 1 1 1 1
symmnumber: 1
zpe: 497819.0 jmol-1
zpe.correction: 0.189609 hartree
zpe.thermalcorrener: 0.202765 hartree
zpe.thermalcorrenthalpy: 0.203709 hartree
zpe.thermalcorrgfe: 0.148440 hartree
zpe.sumelectzpe: -721.178798 hartree
zpe.sumelectthermal: -721.165642 hartree
zpe.sumelectthermalent: -721.164698 hartree
zpe.sumelectthermalfe: -721.219968 hartree
dipole: -3.1021 -1.4429 -1.1024
dipole: 3.5945
quadrupole: -88.2471 -92.6664 -83.3077
quadrupole: 14.6766 -3.7959 -8.0305
quadrupole: -0.1733 -4.5927 4.7660 14.6766 -3.7959 -8.0305
hfenergy: -721.3684073 hartree
pointgroup: C01 [X(C10H10N2O3)]
dipole: 1.210166 0.6245642 -0.3811968 debye
dipolederiv: -0.4877415 0.1255873 -0.0146425 0.0987241 -0.9546759 0.3045179 0.0826271 0.3810891 -0.5576084 -1.6578581 -0.4241268 -0.3269159 -0.3488353 -0.4251561 -0.0973771 -0.3135731 -0.11268 -0.3824846 -0.9893079 0.4120206 0.0724376 0.6507651 -0.9072396 0.0275849 0.0947494 0.0589547 -0.4610048 -1.1844062 0.1058815 0.2074879 0.1498448 -0.4170532 -0.1109582 0.2417508 -0.0708176 -0.6270247 -0.8119295 0.4753192 -0.1457738 0.3675022 -1.1438885 0.3801139 0.1365174 0.2196455 -0.5150861 0.4287169 -0.1152535 0.2597676 -0.3305296 0.3311306 0.1379191 0.5013129 0.1315817 0.023155 0.0614054 0.048945 -0.0900687 0.0763707 -0.1997539 -0.0342195 -0.0820465 -0.0307992 -0.1364005 0.9037546 -0.6031853 -0.0607737 -0.3372427 1.3037341 -0.4321556 -0.5763063 -0.3326283 0.6062206 0.1418076 -0.0242806 0.0197692 -0.0417195 0.0898659 0.1124703 -0.0311189 0.0751783 -0.079836 0.0487513 0.0525648 0.0689452 -0.0041655 0.0461859 0.0977884 0.0549335 0.101362 -0.0599149 1.5017333 -0.5969839 -0.4011271 -0.8613309 1.4359847 -0.3530645 -0.494976 -0.4274331 1.0184369 -0.3148524 -0.088724 -0.0441136 -0.3333761 -0.0634302 0.0275348 -0.181066 0.0368993 -0.150926 -0.4184539 -0.096218 -0.0621401 0.2227312 -0.0201974 0.1082176 0.0999457 0.0840244 -0.1412536 1.5715575 0.3312631 0.2982604 0.1208997 0.0757272 -0.0091446 0.2129428 0.0199948 0.1256332 0.4682916 0.1424181 0.0869639 0.4683624 0.488268 0.1238559 0.2692487 0.1049288 0.3981628 0.0344934 0.0333019 0.0046013 0.0158673 -0.0585531 -0.0848981 -0.0446494 -0.0700185 0.0035294 0.289647 0.0517541 0.073165 0.0912118 0.184925 0.0499036 0.1090767 0.0297747 0.2699984 0.0661091 -0.0737754 -0.0576523 -0.0584221 -0.0121235 -0.0885387 -0.0404082 -0.0821796 0.0877069 0.027575 0.0879653 0.030294 0.100026 0.0312681 -0.0545131 0.0518709 -0.0476175 0.1080676 0.2703745 0.0567011 0.0432141 0.12356 0.2109832 0.0510804 0.040572 0.0641505 0.2648437 0.0093139 0.0771216 0.0306671 0.0770131 0.0499098 -0.056564 0.0194383 -0.0565639 0.1402049 0.0528541 -0.0533438 -0.0366806 -0.0674312 -0.0089164 -0.0957707 -0.0555122 -0.0930926 0.1107216 0.0631933 0.0094349 0.1225344 -0.108244 0.0169078 -0.0380979 -0.0151563 -0.0500385 -0.1485545 0.0830665 0.0786261 -0.0439046 -0.0986273 -0.1483089 0.0478061 -0.0649933 0.0839176 -0.0103787 -0.1580955 -0.0130133 -0.0343147 0.0270459 0.0944066 -0.013491 -0.0151799 -0.0176327 0.1137917 unknown
polarizability: 180.5289364|-7.9620682|122.2045205|1.3917066|9.4869112|85.5721595 unknown
InChI: InChI=1S/C10H10N2O3/c1-15-7-4-2-6(3-5-7)8-9(13)12-10(14)11-8/h2-5,8,11-12H,1H3
charge 0 multiplicity 1
25 atoms
O  -1.903597 -2.188288 1.162836
O  4.219894 0.093578 0.15774
O  -4.064101 1.82566 -0.062998
N  -2.212314 0.646766 -0.992381
N  -3.185946 -0.216406 0.830705
C  -1.433554 -0.571164 -0.715874
C  0.057817 -0.341058 -0.492019
C  -2.168431 -1.133165 0.54719
C  0.994078 -1.317591 -0.916893
C  0.530613 0.814416 0.17152
C  -3.244473 0.878629 -0.093023
C  2.369514 -1.145981 -0.685003
C  1.909069 1.004746 0.409238
C  2.832608 0.017534 -0.019855
C  4.752875 1.264739 0.859926
H  -1.565469 -1.323671 -1.519333
H  -2.01428 1.290564 -1.75545
H  0.643939 -2.223405 -1.425735
H  -0.180837 1.579758 0.503066
H  -3.842121 -0.301652 1.607113
H  3.101656 -1.892178 -1.007084
H  2.246961 1.909842 0.92247
H  4.355553 1.329575 1.891338
H  4.525316 2.200334 0.312979
H  5.840931 1.108916 0.890626
