program: Gaussian 09
title: 000265440
version: EM64L-G09RevD.01
frameworkgroup: C1[X(C9H8N2O3)]
method: RPBEPBE
basis: SDD
operation: Freq
keyword: #pfreq=noraman
keyword: PBEPBE/SDD
title: #p freq=noraman PBEPBE/SDD
converged: YES YES NO NO
title: Mulliken charges:
elementType: O O O N N C C C C C C C C C H H H H H H H H
charge: -0.194721 -0.225835 -0.434563 -0.418908 -0.397538 -0.304127 0.535048 0.181814 0.184697 -0.503014 -0.427729 0.308552 -0.184635 -0.404049 0.270132 0.335255 0.352855 0.274599 0.239979 0.229317 0.224987 0.357883
chargesum: 0.00000
title: Mulliken charges with hydrogens summed into heavy atoms:
elementType: O O O N N C C C C C C C C C
charge: -0.194721 -0.225835 -0.076680 -0.083653 -0.044683 -0.033995 0.535048 0.181814 0.184697 -0.228414 -0.187750 0.308552 0.044682 -0.179062
polarizability: 1.49339775e+02 -1.20486981e+01 1.24285781e+02 9.27715270e-01 5.96656467e+00 7.23779567e+01
1716.lowfreq: -4.6013 -0.0008 -0.0007 -0.0006 2.3962 10.4785 26.0688 56.6357 83.1181
frequency: 26.0458 56.6350 83.1076 157.2755 204.9452 222.2971 232.2806 310.9144 361.8601 377.7517 407.2959 448.3464 479.6304 514.2198 520.0511 555.9930 595.8803 607.8850 648.6942 670.1480 697.2682 712.8058 720.2223 767.3464 789.7150 860.9554 883.0920 911.3413 953.3146 961.0910 966.5279 985.1241 1067.0171 1100.0490 1136.0013 1168.3238 1176.9236 1184.0463 1210.4339 1254.3581 1279.5968 1309.1167 1319.5897 1337.7520 1368.4049 1399.4416 1470.6338 1478.8211 1598.2274 1628.2084 1688.8200 1727.7539 2988.0483 3119.8314 3140.8472 3160.2455 3164.5662 3583.8919 3590.1775 3611.8457
redmass: 6.1751 8.1827 6.0082 7.8675 7.5075 4.5131 5.1088 6.9083 1.1168 8.5179 3.9847 2.8894 1.8290 2.0927 5.5043 4.4356 5.8118 8.3464 1.4626 3.2329 2.2426 5.5188 7.8626 2.9002 2.1361 2.2943 1.7212 1.9038 3.4084 2.9418 1.3596 6.1027 2.2502 1.7295 1.4428 1.5962 1.8404 1.4669 2.0013 1.7036 2.1884 1.6371 1.9382 2.3066 1.7558 5.9953 2.6679 2.6469 6.6481 6.3152 8.5638 9.6057 1.0836 1.0890 1.0899 1.0932 1.0978 1.0661 1.0802 1.0803
irintensity: 0.5085 0.1390 2.5373 2.1152 0.9450 1.1663 4.8167 4.4078 141.7751 17.9563 28.8491 14.7080 51.4497 52.4253 4.8505 4.5557 14.9487 8.6546 125.2876 28.9824 29.3916 23.1813 73.1579 30.3460 28.3851 2.1060 1.2044 19.7647 33.1199 33.0603 1.3644 2.4941 14.0683 13.1419 127.0318 46.8925 50.2902 41.9059 95.5278 15.7436 91.0151 28.3385 59.4443 112.6158 5.8857 17.8300 51.8709 13.8427 38.0016 63.0702 580.9115 375.8067 14.2097 11.1073 11.2433 7.0892 9.1752 40.1703 74.6211 48.4351
temp: 298.150 k
press: 1.00000 atm
elementType: 8 8 8 7 7 6 6 6 6 6 6 6 6 6 1 1 1 1 1 1 1 1
symmnumber: 1
zpe: 424393.4 jmol-1
zpe.correction: 0.161643 hartree
zpe.thermalcorrener: 0.173329 hartree
zpe.thermalcorrenthalpy: 0.174273 hartree
zpe.thermalcorrgfe: 0.122699 hartree
zpe.sumelectzpe: -681.967730 hartree
zpe.sumelectthermal: -681.956044 hartree
zpe.sumelectthermalent: -681.955099 hartree
zpe.sumelectthermalfe: -682.006674 hartree
dipole: 3.9634 -0.7248 -1.7272
dipole: 4.3838
quadrupole: -70.7186 -90.7059 -78.2261
quadrupole: 7.8958 0.8257 5.8146
quadrupole: 9.1649 -10.8223 1.6574 7.8958 0.8257 5.8146
hfenergy: -682.1293726 hartree
pointgroup: C01 [X(C9H8N2O3)]
dipole: -1.5564089 -0.2753545 0.6901997 debye
dipolederiv: -0.4932991 -0.1272223 -0.0395308 -0.1350485 -0.8527039 -0.341345 0.0429614 -0.4120519 -0.6492532 -0.993452 -0.4173485 0.0240934 -0.6273009 -0.8522568 -0.0752497 0.0046982 -0.1095405 -0.4770175 -0.2829058 0.4052668 -0.0626933 0.5558948 -1.1779258 0.2324418 -0.1152826 0.2296737 -0.4845185 -1.13036 -0.121914 0.2031625 -0.1428143 -0.4351579 0.1345943 0.2143061 0.0863604 -0.6042042 -0.8254456 -0.4566697 -0.2061016 -0.3893267 -1.0322227 -0.4356053 0.0689434 -0.2792294 -0.600472 0.2926751 0.1154575 0.2687443 0.2871951 0.3376975 -0.1244078 0.5296718 -0.1074733 -0.0297435 0.3563136 -0.0838008 -0.0788652 0.0356742 0.1281537 -0.05236 -0.0656319 -0.0834499 -0.0671678 0.9524435 0.5941815 0.0204953 0.4156398 1.1670775 0.5024817 -0.5043567 0.4079766 0.7299324 1.5150266 0.6418515 -0.3169101 0.8900193 1.2904944 0.3942554 -0.3482772 0.464859 1.1248221 -0.2814319 0.3216813 -0.0516604 0.0341553 -0.206881 0.001746 0.0013773 0.0445844 -0.16755 -0.3225523 -0.0877857 0.030495 -0.0307244 -0.0417142 -0.0299844 -0.0499231 0.0117048 -0.1683415 0.3258183 -0.4231708 0.108606 -0.5481616 1.1207553 -0.2959111 0.1627107 -0.3021847 0.1808023 0.183153 0.0713184 0.0190879 -0.0699206 0.1221781 -0.0638773 0.0686064 -0.0446295 -0.0867158 -0.0002812 -0.1417261 0.0724836 0.179854 -0.3415894 0.0507185 -0.0155667 0.0123943 -0.2181824 0.0292957 -0.0369098 -0.0028651 -0.0251549 -0.0683531 0.0745695 -0.0434029 0.0616855 0.0276693 0.2809308 -0.0604612 0.0647364 -0.1089094 0.2014382 -0.0592408 0.0945516 -0.0378228 0.2631542 0.2683195 -0.0635537 0.0342759 -0.1215754 0.2301334 -0.0566302 0.0168564 -0.0691909 0.2539128 0.0783787 -0.0790424 0.0017225 -0.0872787 0.0407603 0.0297049 0.0209653 0.0212749 0.146183 0.0704969 0.076167 -0.0391486 0.0581187 -0.0349665 0.0563756 -0.0292769 0.0441752 0.1360713 -0.0164513 -0.0987569 0.0114825 -0.1027777 -0.0162489 0.0322459 0.0006571 0.0315261 0.1451244 -0.1060418 0.0514896 -0.0417886 0.0756313 0.0635259 0.0349604 -0.0486032 0.0324877 0.1628297 0.0993692 -0.0790518 -0.0198217 -0.1431893 0.3578058 -0.0094824 -0.0059846 -0.0031297 0.382665 unknown
polarizability: 150.3096313|10.8609259|123.9791295|0.0229651|-2.0518021|71.7147517 unknown
InChI: InChI=1S/C9H8N2O3/c12-6-3-1-2-5(4-6)7-8(13)11-9(14)10-7/h1-4,7,10-12H
charge 0 multiplicity 1
22 atoms
O  1.329067 -2.118153 -1.397184
O  3.600691 1.656861 0.29595
O  -2.767072 2.379257 -0.493724
N  1.713537 0.429443 1.079998
N  2.664499 -0.234866 -0.837262
C  0.907908 -0.72537 0.663427
C  -0.580176 -0.442177 0.460538
C  1.624582 -1.151163 -0.662601
C  2.753207 0.739363 0.211475
C  -1.02278 0.84538 0.087536
C  -1.511753 -1.498913 0.612924
C  -2.399499 1.073313 -0.130271
C  -2.883904 -1.25976 0.386051
C  -3.339642 0.024789 0.016757
H  1.019121 -1.571908 1.370416
H  1.54092 0.976716 1.92066
H  3.314871 -0.240338 -1.623153
H  -0.321971 1.676555 -0.037666
H  -1.165574 -2.499869 0.891684
H  -3.606239 -2.074897 0.500081
H  -4.408917 0.206472 -0.151982
H  -3.742573 2.445663 -0.644453
