program: Gaussian 09
title: 000265506
version: EM64L-G09RevD.01
frameworkgroup: C1[X(C19H28N2O2S2)]
method: RPBEPBE
basis: SDD
operation: Freq
keyword: #p
keyword: freq=noraman
keyword: PBEPBE/SDD
title: #p freq=noraman PBEPBE/SDD
converged: YES YES NO NO
title: Mulliken charges:
elementType: S S O O N N C C C C C C C C C C C C C C C C C C C H H H H H H H H H H H H H H H H H H H H H H H H H H H H
charge: 0.222385 0.312963 -0.229711 -0.142006 -0.372738 -0.015002 -0.361479 -0.360437 -0.341198 -0.336071 -0.347763 -0.347774 -0.660842 -0.670336 -0.354944 -0.355393 -0.214573 -0.471551 0.188779 0.246470 -0.088469 0.160707 -0.693882 -0.693173 -0.223392 0.188766 0.196274 0.189127 0.191953 0.213099 0.205768 0.212025 0.219896 0.187639 0.191221 0.191618 0.190623 0.247870 0.310791 0.277650 0.264295 0.194541 0.196507 0.195207 0.194168 0.211124 0.209841 0.217106 0.211226 0.211109 0.216642 0.340219 0.273126
chargesum: 0.00000
title: Mulliken charges with hydrogens summed into heavy atoms:
elementType: S S O O N N C C C C C C C C C C C C C C C C C C C
charge: 0.222385 0.312963 -0.229711 -0.142006 -0.032519 -0.015002 0.023561 0.020643 0.077669 0.095850 0.031096 0.034467 -0.102181 -0.128391 0.036104 0.033982 -0.214573 -0.471551 0.188779 0.246470 -0.088469 0.160707 -0.055810 -0.054196 0.049734
polarizability: 3.63739793e+02 -5.84679841e-01 3.25274515e+02 2.62238089e+01 -2.41768595e+01 1.79961534e+02
1716.lowfreq: 0.0008 0.0014 0.0016 3.4802 4.7743 5.6376 11.2004 14.2770 26.0793
frequency: 11.1363 14.2448 25.9960 29.5061 40.5674 47.2262 49.0660 60.2640 67.0123 71.0616 79.6529 101.5788 111.4212 120.9037 126.2999 130.8723 137.1184 142.4007 148.8344 163.4330 171.0299 182.9755 206.3139 223.0545 224.6754 230.3277 267.5156 269.6899 285.8926 306.6183 347.9646 352.0132 357.8484 417.0783 423.2004 434.5022 440.2535 478.4840 487.4437 584.0444 621.5558 655.8543 673.4280 683.3030 726.7856 728.0708 732.6833 742.9211 745.0089 746.8266 755.8205 776.5739 786.0479 787.8545 811.7909 835.8472 850.9862 871.0039 872.6674 889.0273 889.9681 914.4747 971.7608 972.4805 1004.2718 1005.0960 1026.6634 1030.7978 1044.2180 1058.3128 1062.8577 1064.7572 1064.9365 1072.2582 1079.1545 1079.4929 1088.0439 1113.3734 1115.5603 1154.6865 1189.7857 1190.0733 1214.5062 1218.0570 1235.5375 1236.4877 1252.2360 1256.7828 1260.5728 1277.2975 1278.2847 1286.7721 1287.6156 1295.8754 1296.0457 1311.5791 1313.6944 1334.2585 1339.9371 1345.8463 1346.4378 1352.4776 1353.5944 1358.2576 1389.4992 1390.1375 1438.0747 1450.1821 1461.1403 1464.5052 1465.3137 1466.7176 1467.5952 1473.0102 1473.9926 1474.7784 1475.5409 1477.7427 1481.4252 1483.5224 1488.6077 1490.2274 1504.8880 1562.1729 1594.6041 2955.5956 2955.7746 2959.7948 2960.9204 2969.2296 2969.4293 2972.9731 2973.5372 2977.5924 2983.4753 2993.0642 2993.1971 3008.4319 3008.5788 3024.3343 3030.0636 3031.1733 3034.3177 3046.0415 3049.6726 3069.5885 3070.4767 3072.2162 3072.6625 3116.7750 3127.6707 3245.6606 3568.0197
redmass: 4.1595 5.6945 4.8611 4.1333 1.5441 2.1450 4.1451 3.0664 5.2090 4.6080 2.1787 1.9261 3.1467 3.4643 2.5507 2.7679 1.9672 2.9842 3.7223 8.2881 5.8687 6.3574 5.6152 4.1330 1.1730 1.1281 7.1278 5.6705 5.0541 5.6792 8.8442 7.9838 11.9274 3.8643 4.0048 3.5002 3.4346 10.8511 10.4519 10.1752 3.8721 8.8436 5.9231 6.4605 1.0671 1.0660 1.9942 1.0962 1.1258 2.0490 10.5484 10.6040 1.1742 1.1569 1.5554 10.5992 7.2912 1.2292 1.2109 1.9027 1.8944 8.3562 1.1863 1.1898 3.9067 3.9087 3.7955 3.6865 2.6439 1.3381 2.8737 2.1427 1.8275 1.8174 2.3147 2.2942 3.7396 2.3855 2.4308 2.9102 1.7036 1.6874 1.2280 1.2326 1.3539 1.3470 2.4042 1.2697 1.3747 1.1603 1.1631 1.0616 1.0664 1.1023 1.1002 1.3415 1.3352 6.8435 2.5448 1.4565 1.4829 1.6108 1.6396 4.7206 1.2140 1.2154 1.0981 8.1819 1.1007 1.0678 1.0764 1.0696 1.0763 1.0736 4.9330 1.0697 1.0424 1.0448 1.0774 1.0812 1.0911 1.0933 8.6010 10.8111 11.0509 1.0588 1.0588 1.0589 1.0591 1.0592 1.0590 1.0365 1.0365 1.0590 1.0605 1.0974 1.0976 1.1008 1.1011 1.0812 1.0847 1.1015 1.0600 1.1022 1.1032 1.1007 1.1007 1.0993 1.0994 1.1075 1.1050 1.0992 1.0823
irintensity: 0.0404 0.5780 0.5503 0.4982 0.1077 1.0101 2.4874 0.1826 1.6328 1.1820 1.3177 0.5196 0.1711 0.2328 0.3084 0.7232 0.6976 1.1397 0.0638 9.8488 1.2052 0.6749 0.6499 3.7941 0.1733 0.0167 4.3799 6.4918 1.5854 2.2727 1.4364 0.7862 23.2670 2.2160 2.4946 1.2611 0.3023 12.4893 4.4720 1.3877 9.3849 9.9644 8.3737 20.4656 12.5823 10.9891 88.7103 4.1097 8.0539 30.9758 18.9702 48.8422 4.5940 2.6166 13.2854 27.5762 4.3530 0.6720 1.6805 3.3381 2.7521 0.8791 4.0792 1.5712 1.2753 1.9066 2.6661 2.2793 26.0502 79.3852 13.5582 3.3987 32.6864 67.4745 2.0740 3.7977 112.2590 17.2986 16.4837 132.4146 1.0831 0.2713 1.2685 4.3504 1.7901 0.2945 30.2129 18.1465 5.1212 1.7170 0.6498 0.3157 0.3010 0.1855 0.3246 10.3894 12.1968 9.8363 52.5778 8.2953 0.8485 0.5857 1.5441 169.3084 11.1024 11.3932 27.0599 266.5516 11.0152 0.3713 0.5120 2.3884 1.3929 1.3685 14.3774 1.5043 12.5383 11.6819 2.9620 3.7280 21.2417 23.0536 51.0237 293.7740 34.7737 0.4923 1.1871 4.9818 3.0733 57.4427 79.6283 36.8139 39.5128 64.7749 40.9714 1.4230 0.3925 0.0214 0.3117 13.0876 13.3964 20.6955 9.0973 78.8889 59.4273 90.2216 86.3272 54.6250 51.8986 13.0928 16.1340 0.7053 77.7895
temp: 298.150 k
press: 1.00000 atm
elementType: 16 16 8 8 7 7 6 6 6 6 6 6 6 6 6 6 6 6 6 6 6 6 6 6 6 1 1 1 1 1 1 1 1 1 1 1 1 1 1 1 1 1 1 1 1 1 1 1 1 1 1 1 1
symmnumber: 1
zpe: 1145560.1 jmol-1
zpe.correction: 0.436321 hartree
zpe.thermalcorrener: 0.465382 hartree
zpe.thermalcorrenthalpy: 0.466326 hartree
zpe.thermalcorrgfe: 0.370746 hartree
zpe.sumelectzpe: -1794.955474 hartree
zpe.sumelectthermal: -1794.926413 hartree
zpe.sumelectthermalent: -1794.925469 hartree
zpe.sumelectthermalfe: -1795.021049 hartree
dipole: -3.8334 -3.9566 2.9097
dipole: 6.2302
quadrupole: -164.2000 -167.5509 -165.5515
quadrupole: -30.2184 11.5257 -4.9949
quadrupole: 1.5675 -1.7835 0.2160 -30.2184 11.5257 -4.9949
hfenergy: -1795.3917951 hartree
pointgroup: C01 [X(C19H28N2O2S2)]
dipole: -1.7501683 -1.3715466 -1.0314727 debye
polarizability: 327.0361756|2.801648|361.3491064|15.3636442|-34.7478993|180.5905598 unknown
InChI: InChI=1S/C19H28N2O2S2/c1-3-5-7-9-11-24-18-16(22)14-15(21-13-20-14)17(23)19(18)25-12-10-8-6-4-2/h13,20H,3-12H2,1-2H3
charge 0 multiplicity 1
53 atoms
S  -0.853725 0.6402 1.575054
S  2.548412 1.278944 1.220721
O  -2.416786 2.759895 -0.05433
O  2.96896 4.00063 0.361046
N  -1.239094 5.280392 -1.112583
N  0.946028 5.894828 -0.935244
C  -3.515844 -2.294921 0.079653
C  3.04458 -2.747775 0.064288
C  -2.55425 -1.518317 1.012873
C  3.342543 -1.270525 0.422259
C  -4.080905 -3.574417 0.73768
C  4.325865 -3.549524 -0.259794
C  -2.02943 -0.238589 0.344035
C  2.048028 -0.490292 0.712538
C  -5.036614 -4.361921 -0.187704
C  4.045357 -5.028606 -0.611816
C  -0.169389 2.044575 0.625109
C  1.195034 2.344591 0.643035
C  -0.582729 4.220758 -0.502175
C  -1.16016 2.978731 0.010256
C  0.758956 4.612746 -0.401304
C  1.749806 3.707058 0.207023
C  -5.601182 -5.636365 0.476153
C  5.329337 -5.819926 -0.942354
C  -0.283358 6.265868 -1.356807
H  -2.984775 -2.567115 -0.856141
H  -4.355389 -1.633007 -0.216855
H  2.358535 -2.787051 -0.807517
H  2.510693 -3.233127 0.907505
H  -3.0870 -1.255757 1.948573
H  -1.707589 -2.174713 1.29825
H  4.00915 -1.23927 1.307602
H  3.892257 -0.787483 -0.408331
H  -3.241832 -4.234221 1.042708
H  -4.617393 -3.301588 1.670181
H  4.857602 -3.066803 -1.105843
H  5.016399 -3.504991 0.608033
H  -1.440166 -0.463088 -0.562018
H  -2.831874 0.472753 0.102853
H  1.460095 -0.938545 1.527942
H  1.410574 -0.405359 -0.183464
H  -4.499258 -4.635279 -1.118826
H  -5.87336 -3.701479 -0.494342
H  3.519157 -5.512149 0.2365
H  3.350391 -5.072848 -1.475343
H  -6.168165 -5.388189 1.39322
H  -4.787109 -6.328614 0.763112
H  -6.281783 -6.179685 -0.204777
H  6.029365 -5.815241 -0.085639
H  5.856423 -5.375814 -1.807738
H  5.103595 -6.873717 -1.188551
H  -2.240569 5.307588 -1.312019
H  -0.518517 7.214452 -1.833386
