program: Gaussian 09
title: 000265455
version: EM64L-G09RevD.01
frameworkgroup: C1[X(C11H13N5S)]
method: RPBEPBE
basis: SDD
operation: Freq
keyword: #p
keyword: freq=noraman
keyword: PBEPBE/SDD
title: #p freq=noraman PBEPBE/SDD
converged: YES YES NO NO
title: Mulliken charges:
elementType: S N N N N N C C C C C C C C C C C H H H H H H H H H H H H H
charge: 0.150747 -0.029203 -0.374865 -0.678079 -0.089870 -0.595219 -0.866765 0.547823 -0.326270 0.320548 -0.392682 -0.364092 0.176804 -0.221757 -0.224416 -0.240746 -0.397766 0.318829 0.266808 0.230422 0.262930 0.223544 0.224270 0.226352 0.315036 0.315274 0.366218 0.237767 0.313492 0.304867
chargesum: 0.00000
title: Mulliken charges with hydrogens summed into heavy atoms:
elementType: S N N N N N C C C C C C C C C C C
charge: 0.150747 -0.029203 -0.059828 0.003413 -0.089870 0.023140 -0.281128 0.547823 -0.326270 0.320548 -0.162261 -0.101162 0.176804 0.001787 -0.000147 -0.014394 -0.159999
polarizability: 2.40375200e+02 -1.57928158e+01 1.65159523e+02 -5.05461187e+00 -7.43198455e+00 1.31875359e+02
1716.lowfreq: -12.2593 -9.9221 -4.6234 -0.0021 -0.0015 0.0016 9.7982 22.5562 41.4304
frequency: 7.7028 22.1133 41.4021 42.4285 87.1741 114.1795 141.1987 185.5797 213.8954 268.1985 292.0416 303.6974 345.0384 357.7961 385.5716 402.9972 405.2830 420.8977 460.8983 473.2819 550.8845 554.3097 587.7471 589.9027 616.1860 621.3173 628.6686 636.8203 703.1744 755.5435 763.1990 774.0309 778.1464 798.8720 803.6746 855.2194 868.4560 883.7371 886.9817 928.8119 980.1017 989.2572 996.6649 1026.0490 1078.8144 1096.2195 1143.3936 1164.4559 1170.5766 1177.3722 1187.1295 1221.3159 1224.7701 1249.8989 1251.0344 1315.7217 1328.5036 1335.8742 1383.8306 1393.3995 1403.1274 1440.5165 1451.2251 1482.1798 1483.6317 1521.6203 1552.9834 1586.3617 1592.1241 1612.4577 1675.5395 3032.3264 3113.3433 3115.6391 3124.0972 3136.6432 3147.6751 3162.0264 3169.5774 3388.9962 3407.4880 3465.6785 3518.0794 3625.1582
redmass: 6.0734 4.2915 3.7204 4.6898 5.2672 6.6568 4.9210 5.6708 11.9157 5.0937 3.4280 3.8231 2.1560 1.3538 6.2285 2.8242 2.4948 1.4062 5.1243 4.6531 5.4121 5.3576 4.8576 1.9266 6.2696 2.1700 4.4486 6.3723 1.7022 2.8759 1.5710 2.0950 1.6259 3.9131 4.0457 1.2531 4.3894 1.3814 1.7580 1.4487 1.3828 5.8627 1.3329 2.2035 1.5679 2.1422 4.7802 2.8133 1.1574 1.2006 1.1134 3.0261 2.2348 1.1654 1.1982 3.6088 1.2638 3.9204 8.0329 1.4508 5.0753 2.0028 1.1842 2.3080 2.2676 4.9198 2.2262 1.7939 6.0579 6.0557 1.1357 1.0593 1.1026 1.0900 1.0870 1.0921 1.0961 1.1016 1.0919 1.0453 1.0508 1.0762 1.1005 1.0968
irintensity: 1.9131 1.6288 14.4196 0.1637 0.2345 2.4332 3.2314 0.8627 1.8886 8.0111 21.8097 6.5409 2.6728 12.9284 0.8139 0.6873 43.6543 108.6207 3.3141 2.2463 16.8882 1.1434 21.7993 66.3352 0.1725 55.7525 91.1047 24.8765 59.9016 29.2847 108.8057 30.4687 203.9376 24.2520 5.6171 0.2919 3.1922 14.9248 1.3596 3.5624 0.3163 0.1252 0.4980 6.7441 11.2240 160.2388 2.9893 2.5158 0.1741 0.4145 2.3827 7.7991 23.2713 4.0126 3.0863 5.0968 0.7170 9.2712 0.4421 10.2931 106.8604 14.7073 21.8913 24.3613 53.0223 310.0221 154.3063 201.8990 1.2067 3.6124 50.7918 28.7330 1.3484 9.1853 1.3486 21.1858 29.0829 27.3897 16.7232 17.8022 174.6756 33.3350 4.9540 63.5234
temp: 298.150 k
press: 1.00000 atm
elementType: 16 7 7 7 7 7 6 6 6 6 6 6 6 6 6 6 6 1 1 1 1 1 1 1 1 1 1 1 1 1
symmnumber: 1
zpe: 612966.1 jmol-1
zpe.correction: 0.233466 hartree
zpe.thermalcorrener: 0.249476 hartree
zpe.thermalcorrenthalpy: 0.250420 hartree
zpe.thermalcorrgfe: 0.186547 hartree
zpe.sumelectzpe: -1097.533433 hartree
zpe.sumelectthermal: -1097.517423 hartree
zpe.sumelectthermalent: -1097.516479 hartree
zpe.sumelectthermalfe: -1097.580352 hartree
dipole: -3.1572 -0.6933 4.1228
dipole: 5.2389
quadrupole: -77.3640 -104.7562 -102.1656
quadrupole: -0.0277 -14.7091 1.0234
quadrupole: 17.3979 -9.9942 -7.4037 -0.0277 -14.7091 1.0234
hfenergy: -1097.766899 hartree
pointgroup: C01 [X(C11H13N5S1)]
dipole: 1.1722255 1.0832718 1.3041159 debye
polarizability: 238.1891765|-10.5980814|162.6223317|19.0925459|-12.578592|136.5985741 unknown
InChI: InChI=1S/C11H13N5S/c12-9-10(16-13)14-7-15-11(9)17-6-8-4-2-1-3-5-8/h1-5,7,16H,6,12-13H2
charge 0 multiplicity 1
30 atoms
S  -0.146573 1.247274 -1.781352
N  0.828286 -1.269723 -1.139935
N  4.256926 -0.02996 0.891492
N  2.360931 1.991345 -0.189253
N  2.871664 -1.691847 0.074702
N  4.568636 1.261779 1.376374
C  -1.653888 0.0946 -2.063787
C  -2.624074 0.087083 -0.909007
C  1.035541 0.067414 -1.007172
C  2.153251 0.62613 -0.319509
C  -3.725238 0.982012 -0.872605
C  -2.45254 -0.831883 0.160316
C  3.070477 -0.347406 0.212772
C  -4.634054 0.963291 0.208796
C  -3.359655 -0.850709 1.242183
C  -4.453399 0.046604 1.270862
C  1.758651 -2.096291 -0.593559
H  -1.195398 -0.892822 -2.237344
H  -2.098464 0.484178 -2.993051
H  -3.868901 1.694632 -1.694587
H  -1.602479 -1.523041 0.133138
H  -5.481984 1.657725 0.222358
H  -3.21765 -1.566453 2.060059
H  -5.158787 0.030213 2.109517
H  4.777946 -0.851407 1.219765
H  1.631187 2.642591 -0.472206
H  3.151287 2.276041 0.400542
H  1.601454 -3.172769 -0.697611
H  5.480846 1.594858 1.043282
H  4.452301 1.361843 2.394322
