program: Gaussian 09
title: 000265452
version: EM64L-G09RevD.01
frameworkgroup: C1[X(C18H18Cl2N2O2)]
method: RPBEPBE
basis: SDD
operation: Freq
keyword: #p
keyword: freq=noraman
keyword: PBEPBE/SDD
title: #p freq=noraman PBEPBE/SDD
converged: YES YES NO NO
title: Mulliken charges:
elementType: Cl Cl O O N N C C C C C C C C C C C C C C C C C C H H H H H H H H H H H H H H H H H H
charge: -0.051948 -0.053099 -0.445957 -0.261245 -0.166878 -0.084468 0.451231 -0.391909 -0.390915 -0.370329 -0.349727 -0.584609 -0.584215 0.481583 -0.406410 -0.414835 -0.358409 0.170427 0.119598 -0.369425 -0.303256 -0.208024 -0.249706 0.105795 0.253948 0.249949 0.250098 0.251946 0.233717 0.233772 0.268687 0.294042 0.269383 0.294745 0.232099 0.273929 0.239188 0.251831 0.275959 0.231088 0.232573 0.379774
chargesum: 0.00000
title: Mulliken charges with hydrogens summed into heavy atoms:
elementType: Cl Cl O O N N C C C C C C C C C C C C C C C C C C
charge: -0.051948 -0.053099 -0.066183 -0.261245 -0.166878 -0.084468 0.451231 0.111988 0.111130 -0.136612 -0.115955 -0.021879 -0.020086 0.481583 -0.174311 -0.140906 -0.119222 0.170427 0.119598 -0.117594 -0.027297 0.023064 -0.017133 0.105795
polarizability: 4.75573491e+02 2.18690936e+01 2.35088186e+02 -8.87944958e+00 -4.88296610e+00 1.49440868e+02
1716.lowfreq: -4.9888 -0.0018 -0.0013 0.0019 1.3476 3.2885 14.6696 20.5274 24.8455
frequency: 14.6138 20.3506 24.8311 29.4817 36.3735 47.8629 59.9377 62.0895 88.3349 105.6111 117.1564 130.4731 146.9986 193.7632 198.8850 210.7980 221.8920 241.8609 244.3720 268.2343 325.1375 331.8465 370.5446 394.6423 397.9522 418.1403 428.4428 443.2016 507.4526 525.1281 534.0164 543.1578 550.0007 582.7663 600.8359 613.9530 634.1621 669.7352 685.7532 700.0091 713.3266 736.3752 737.7562 764.6275 779.9738 783.8806 789.3717 811.1704 829.0405 833.8566 845.4512 879.4890 942.4239 952.4406 969.5258 978.9115 985.4805 989.4227 992.4268 998.0273 999.7841 1034.8643 1035.4234 1039.2433 1042.3732 1109.4156 1118.2622 1134.6081 1150.9756 1174.1883 1174.4096 1186.5115 1204.1389 1219.2708 1256.2819 1259.1289 1260.5754 1265.8922 1278.6018 1292.5114 1303.7310 1319.8436 1352.5983 1354.4936 1361.1694 1373.3304 1391.1786 1396.5810 1432.8336 1442.8820 1459.7866 1460.6026 1468.7621 1486.1420 1505.9762 1523.2810 1554.0414 1563.4896 1599.0864 1621.5207 1628.9213 1653.5163 3002.1962 3017.8804 3023.1215 3062.6207 3062.9596 3073.7165 3079.2470 3124.2881 3132.1370 3144.6287 3146.8546 3147.5913 3152.4923 3161.0710 3165.2908 3166.5752 3182.3079 3529.4574
redmass: 8.0589 8.0948 9.9945 14.8478 12.4147 7.8438 4.9700 4.2398 3.6752 4.4976 3.2056 2.9164 5.4322 3.9808 7.9190 4.3900 6.7212 4.5371 6.3657 3.8007 4.7192 4.5349 4.4285 4.5236 4.2700 3.3388 3.2905 5.1009 3.4251 3.9196 4.3088 4.0875 3.2484 1.2382 4.8833 6.1343 7.0217 6.8726 3.8500 5.3932 4.7421 3.7536 3.6612 2.5092 1.9216 1.1283 1.1806 1.3638 2.8272 2.0912 4.3174 1.5396 1.3662 2.8640 1.3918 1.4836 3.5908 1.5870 1.3579 2.8596 1.4347 4.5708 2.2540 2.3758 1.9535 1.9867 1.6007 1.3761 1.7208 1.1824 1.7213 1.6814 1.3348 2.0946 1.1708 1.1722 1.6459 1.6134 1.3295 1.1807 2.3828 1.4873 1.2789 1.4299 2.4175 9.0222 1.8802 2.1612 2.4590 3.1454 1.1032 1.1058 2.5111 1.0968 1.1219 2.8513 6.5431 6.8293 6.5106 6.2797 7.6600 8.4911 1.0894 1.0601 1.0607 1.0572 1.0578 1.1032 1.1039 1.0891 1.0863 1.0890 1.1111 1.1104 1.0906 1.0937 1.0964 1.0958 1.0971 1.0641
irintensity: 0.0712 0.0084 0.1234 0.8005 1.6264 1.9385 1.2593 0.1980 1.0475 1.7431 1.3678 1.3632 1.8367 10.5745 4.2312 2.8840 0.6256 12.8379 2.4786 0.9343 1.9989 5.7514 3.0645 30.3926 3.8938 9.3602 5.7167 1.9575 30.6305 12.7034 15.0780 14.0683 3.2970 100.3648 34.0364 6.7734 3.1036 106.9622 51.1978 89.2764 15.0402 12.9945 4.4852 44.4666 23.5464 3.9737 10.1810 19.4362 28.5537 52.5388 79.1003 5.7672 11.1704 37.6352 14.5347 49.9418 282.6002 5.2696 4.5188 0.6695 3.8608 0.4918 0.0475 28.6829 1.5228 52.5233 28.2879 54.3250 232.4318 72.2628 216.4313 0.1526 16.8398 30.8734 12.2778 14.6216 33.4049 3.3509 70.1340 6.5706 76.4154 37.9264 2.4140 136.9630 12.8079 8.8153 113.5851 46.0076 9.1331 17.3523 14.8459 11.5770 96.5037 26.9134 0.2863 303.0387 99.3486 81.4571 220.5172 678.5439 267.6202 366.2906 30.7070 22.2935 25.3540 5.5235 24.5357 9.1347 7.6083 11.9978 6.4828 10.4147 10.6220 11.7996 15.5858 25.1525 16.2809 17.1755 15.3833 42.4595
temp: 298.150 k
press: 1.00000 atm
elementType: 17 17 8 8 7 7 6 6 6 6 6 6 6 6 6 6 6 6 6 6 6 6 6 6 1 1 1 1 1 1 1 1 1 1 1 1 1 1 1 1 1 1
symmnumber: 1
zpe: 848741.2 jmol-1
zpe.correction: 0.323268 hartree
zpe.thermalcorrener: 0.346602 hartree
zpe.thermalcorrenthalpy: 0.347546 hartree
zpe.thermalcorrgfe: 0.265120 hartree
zpe.sumelectzpe: -1875.048791 hartree
zpe.sumelectthermal: -1875.025458 hartree
zpe.sumelectthermalent: -1875.024514 hartree
zpe.sumelectthermalfe: -1875.106940 hartree
dipole: -0.5665 -0.2747 -1.1466
dipole: 1.3081
quadrupole: -150.9924 -161.9578 -151.6509
quadrupole: -1.0045 -2.7591 -6.3698
quadrupole: 3.8746 -7.0908 3.2162 -1.0045 -2.7591 -6.3698
hfenergy: -1875.3720597 hartree
pointgroup: C01 [X(C18H18Cl2N2O2)]
dipole: 0.2272138 0.1078321 -0.4490072 debye
polarizability: 476.1274157|17.7106164|234.3417089|10.950764|5.4945844|149.633421 unknown
InChI: InChI=1S/C18H18Cl2N2O2/c19-9-11-22(12-10-20)15-7-5-14(6-8-15)13-21-17-4-2-1-3-16(17)18(23)24/h1-8,13,23H,9-12H2
charge 0 multiplicity 1
42 atoms
Cl 5.87699 -3.808426 0.808964
Cl 6.49763 3.413871 -0.375719
O  -4.946243 2.175785 1.848741
O  -2.776415 1.994476 1.075893
N  4.271432 -0.069701 -0.011027
N  -2.256897 -0.588065 -0.305313
C  2.876098 0.023022 -0.185742
C  4.885015 -1.187514 0.729336
C  5.185555 0.944432 -0.567161
C  2.284327 1.142092 -0.851971
C  1.998244 -1.002223 0.300158
C  5.095137 -2.407457 -0.18812
C  5.329088 2.142564 0.391099
C  0.026489 0.205895 -0.539353
C  0.89302 1.220925 -1.023677
C  0.612017 -0.90541 0.128434
C  -1.421575 0.325702 -0.725549
C  -3.657388 -0.53111 -0.403715
C  -4.505188 0.43371 0.252478
C  -4.280868 -1.600438 -1.115308
C  -5.921354 0.286724 0.167135
C  -5.677547 -1.700962 -1.216957
C  -6.510984 -0.752831 -0.569158
C  -3.956625 1.559023 1.048737
H  4.268251 -1.470784 1.599971
H  5.86231 -0.863056 1.128012
H  6.178689 0.488316 -0.725498
H  4.835837 1.290602 -1.555443
H  2.903738 1.959522 -1.231613
H  2.398872 -1.882046 0.812209
H  5.794825 -2.195464 -1.010343
H  4.149232 -2.80605 -0.581644
H  5.783253 1.856341 1.351418
H  4.376987 2.666186 0.557625
H  0.466451 2.094784 -1.53166
H  -0.051676 -1.69093 0.504627
H  -1.768705 1.230023 -1.259647
H  -3.627947 -2.346478 -1.57899
H  -6.543277 1.015664 0.69289
H  -6.120478 -2.524945 -1.787803
H  -7.600703 -0.835663 -0.631157
H  -4.513016 2.9271 2.335839
