program: Gaussian 09
title: 000024744
version: EM64L-G09RevD.01
frameworkgroup: C1[X(C16H16N2O4)]
method: RPBEPBE
basis: SDD
operation: Freq
keyword: #p
keyword: freq=noraman
keyword: PBEPBE/SDD
title: #p freq=noraman PBEPBE/SDD
converged: YES YES NO NO
title: Mulliken charges:
elementType: O O O O N N C C C C C C C C C C C C C C C C H H H H H H H H H H H H H H H H
charge: -0.345650 -0.256261 -0.312225 -0.270351 -0.463593 -0.463573 0.500095 0.494209 -0.621366 0.521272 0.424777 -0.369826 -0.415917 -0.555018 -0.202733 -0.807974 -0.480630 -0.350414 -0.174958 0.235052 0.267135 -0.493683 0.226516 0.297383 0.232108 0.321677 0.225055 0.338019 0.226297 0.305558 0.223649 0.237505 0.226839 0.228812 0.333628 0.242577 0.233637 0.242371
chargesum: 0.00000
title: Mulliken charges with hydrogens summed into heavy atoms:
elementType: O O O O N N C C C C C C C C C C C C C C C C
charge: -0.345650 -0.256261 -0.312225 -0.270351 -0.125574 -0.129945 0.500095 0.494209 -0.394849 0.521272 0.424777 -0.072443 -0.183809 -0.233341 0.022322 -0.119980 -0.254333 -0.044856 0.053854 0.235052 0.267135 0.224902
polarizability: 3.41692339e+02 4.27141413e+00 2.34855481e+02 1.33922692e-01 4.53601804e-01 8.89227137e+01
1716.lowfreq: -7.9169 -3.3098 -0.0008 0.0008 0.0008 2.4962 6.3822 24.8544 28.7978
frequency: 5.7817 24.7291 28.7023 40.6685 54.0085 58.9666 65.4470 77.9712 89.4141 93.7887 152.3767 178.7516 189.3676 208.6524 231.9339 254.8365 255.1508 256.5948 288.0899 321.1790 335.2966 385.2555 408.1937 441.2038 456.1717 504.7748 524.2088 561.7621 599.2918 599.6588 640.2877 641.2377 647.4936 671.1564 688.3410 697.9107 698.1903 700.0204 701.0943 725.1519 792.3845 800.4016 803.2437 874.2339 885.2414 893.5099 895.0666 916.3042 922.4553 931.7774 976.2026 980.7415 985.7334 989.9397 990.3344 1018.8227 1039.4658 1047.6917 1096.9034 1100.2468 1120.4259 1140.7684 1145.6768 1149.4017 1175.8920 1185.3970 1187.8119 1198.6165 1264.3882 1282.0402 1292.3566 1319.3937 1383.7036 1393.4383 1398.0697 1411.1521 1424.9902 1445.1756 1452.4813 1468.6416 1470.6017 1473.7269 1477.3172 1491.1629 1514.5404 1527.7903 1596.5744 1603.0018 1622.6469 1626.8006 1669.0978 1678.5300 2976.3367 3002.3162 3058.0349 3085.4667 3102.8046 3105.5716 3124.2993 3126.5475 3145.3956 3150.5745 3154.5488 3194.0962 3195.0728 3216.3345 3541.4475 3546.4071
redmass: 4.0482 5.8036 1.0412 5.3131 3.4734 5.4717 3.7648 1.4685 6.0907 5.3863 3.5309 4.9732 5.7426 3.1195 4.9279 4.4442 4.8748 6.0931 4.9769 8.0322 4.6560 4.9325 3.9653 2.8040 3.0805 6.4469 6.1281 3.2481 5.9993 4.4185 1.3448 7.1228 1.8221 6.3865 2.3295 4.2346 3.5841 2.2024 5.3381 6.8646 1.4863 1.6845 3.5027 1.4252 6.4971 1.3970 6.6139 1.3918 1.4426 3.4894 1.3135 4.6699 6.0928 1.7148 1.6380 2.8740 3.3687 1.5617 1.6129 1.5653 1.2542 2.2418 2.4972 1.7177 2.3195 1.0866 1.2738 1.7376 2.4777 2.4633 1.3639 1.4649 6.9919 7.1549 1.2324 2.3549 1.2406 2.5473 1.0492 1.1002 1.2210 1.0777 2.5443 2.1165 2.2649 2.1529 5.3205 5.4118 6.2443 6.2136 8.2655 9.5278 1.0384 1.0299 1.0954 1.0998 1.1048 1.0913 1.0887 1.0874 1.1043 1.0958 1.0952 1.0949 1.0928 1.0947 1.0760 1.0762
irintensity: 1.0513 2.0257 0.6300 0.8137 0.5815 2.5519 4.4416 1.3163 0.0014 0.3903 6.8638 7.7830 0.0210 4.4109 0.2672 6.6059 1.7142 2.3463 4.5849 36.8582 0.9149 0.7516 0.1359 8.1264 7.1888 10.1150 7.6793 5.2912 0.9198 8.1628 28.0805 2.6231 22.9008 23.4854 0.0837 29.8566 31.9906 21.3092 92.0710 2.1734 75.0997 58.2549 21.5606 18.6256 75.5706 0.0699 5.1560 6.3778 50.8473 8.3466 3.2243 94.1047 4.3921 47.8956 39.5232 259.7288 55.3812 18.9978 27.9205 35.3533 0.2408 206.6387 919.5333 69.8658 295.4978 3.5490 175.0312 28.1803 26.2788 6.7212 20.8822 27.4326 100.6111 17.6462 15.6811 136.4479 2.1748 182.7718 13.7574 88.2838 18.2558 23.3407 15.1524 246.2653 872.6310 100.8578 85.1241 10.5739 193.0350 82.4635 161.6252 301.7106 35.8117 47.8450 22.4028 16.7079 29.0258 19.5345 12.5317 8.3831 18.9249 25.7834 20.6188 4.5136 10.7719 8.0886 28.2628 38.8312
temp: 298.150 k
press: 1.00000 atm
elementType: 8 8 8 8 7 7 6 6 6 6 6 6 6 6 6 6 6 6 6 6 6 6 1 1 1 1 1 1 1 1 1 1 1 1 1 1 1 1
symmnumber: 1
zpe: 770159.9 jmol-1
zpe.correction: 0.293338 hartree
zpe.thermalcorrener: 0.314521 hartree
zpe.thermalcorrenthalpy: 0.315465 hartree
zpe.thermalcorrgfe: 0.238169 hartree
zpe.sumelectzpe: -1028.156593 hartree
zpe.sumelectthermal: -1028.135411 hartree
zpe.sumelectthermalent: -1028.134467 hartree
zpe.sumelectthermalfe: -1028.211763 hartree
dipole: -1.9646 1.7658 0.0639
dipole: 2.6424
quadrupole: -88.4841 -116.2463 -133.9396
quadrupole: 7.2867 0.4468 0.1475
quadrupole: 24.4059 -3.3563 -21.0496 7.2867 0.4468 0.1475
hfenergy: -1028.4499316 hartree
pointgroup: C01 [X(C16H16N2O4)]
dipole: 0.7099322 0.6778265 -0.342465 debye
polarizability: 341.6069599|5.5001501|207.8673336|-0.1409329|-56.7235566|115.9962406 unknown
InChI: InChI=1S/C16H16N2O4/c1-11-5-3-6-12(9-11)18-16(20)22-14-8-4-7-13(10-14)17-15(19)21-2/h3-10,17-18H,1-2H3
charge 0 multiplicity 1
38 atoms
O  -0.036218 -0.298885 0.197784
O  -1.481147 -2.020635 1.008689
O  6.145385 1.883583 -0.768353
O  3.822608 2.232262 -0.959399
N  -2.243859 0.002185 0.039425
N  4.765078 0.265928 -0.016058
C  -3.660979 -0.124013 0.089961
C  -5.83495 0.928259 -0.419767
C  -4.422075 0.958443 -0.425328
C  3.625213 -0.506297 0.334866
C  1.227655 -0.887366 0.488571
C  -4.317088 -1.260949 0.627076
C  -6.485681 -0.210448 0.122975
C  2.303491 -0.056905 0.109063
C  -5.72787 -1.285879 0.635187
C  -6.63588 2.079193 -1.004847
C  3.850962 -1.775363 0.934706
C  1.421215 -2.153581 1.086742
C  2.7534 -2.576369 1.300143
C  -1.295313 -0.902209 0.476983
C  4.793203 1.516523 -0.609164
C  6.356692 3.205979 -1.391281
H  -3.905516 1.836775 -0.836353
H  -3.732294 -2.09161 1.026031
H  -7.58102 -0.249975 0.142775
H  2.113283 0.914511 -0.350146
H  -6.23987 -2.159968 1.053104
H  -1.861957 0.859515 -0.366382
H  4.874616 -2.126895 1.111209
H  0.572584 -2.775093 1.370155
H  -6.082949 3.033275 -0.946715
H  -6.869496 1.897661 -2.071965
H  -7.596956 2.208654 -0.476827
H  2.931511 -3.553163 1.762272
H  5.6831 -0.135683 0.185746
H  5.912923 3.231898 -2.400877
H  7.44873 3.321589 -1.438052
H  5.90137 3.999649 -0.77505
