program: Gaussian 09
title: 000265451
version: EM64L-G09RevD.01
frameworkgroup: C1[X(C18H18Cl2N4O3)]
method: RPBEPBE
basis: SDD
operation: Freq
keyword: #p
keyword: freq=noraman
keyword: PBEPBE/SDD
title: #p freq=noraman PBEPBE/SDD
converged: YES YES NO NO
title: Mulliken charges:
elementType: Cl Cl O O O N N N N C C C C C C C C C C C C C C C C C C H H H H H H H H H H H H H H H H H H
charge: -0.049630 -0.051757 -0.225991 -0.198749 -0.209243 -0.166687 0.051744 -0.415348 0.020906 -0.391107 -0.391372 0.456553 -0.365379 -0.349800 -0.583714 -0.584228 0.473635 -0.417484 -0.402467 -0.391024 0.305193 -0.475523 0.372389 -0.357409 0.178826 -0.357971 -0.181057 0.253567 0.250295 0.251277 0.251370 0.234891 0.236406 0.268744 0.294325 0.270213 0.292743 0.225261 0.282294 0.206774 0.270818 0.287040 0.291385 0.246820 0.292471
chargesum: 0.00000
title: Mulliken charges with hydrogens summed into heavy atoms:
elementType: Cl Cl O O O N N N N C C C C C C C C C C C C C C C C C C
charge: -0.049630 -0.051757 -0.225991 -0.198749 -0.209243 -0.166687 0.051744 -0.122877 0.020906 0.112755 0.111275 0.456553 -0.130488 -0.113394 -0.020645 -0.021272 0.473635 -0.192223 -0.120173 -0.184250 0.305193 -0.204705 0.372389 -0.070368 0.178826 -0.066587 0.065762
polarizability: 6.07070282e+02 -2.05815424e+01 2.76977024e+02 1.45073423e+01 -3.76081900e+01 1.36913277e+02
1716.lowfreq: -6.4685 -2.3739 -0.0014 -0.0013 0.0004 3.8687 8.1265 15.8367 20.7461
frequency: 8.0891 15.8020 20.7342 29.1658 33.5641 43.1727 51.3485 59.4464 69.7846 78.3699 95.0108 117.1119 133.2068 153.4125 170.8403 179.9570 194.0154 199.6103 209.5846 230.3689 241.7309 248.8904 293.0580 298.3590 329.9118 348.3742 372.1286 401.9166 412.8362 418.1031 427.3107 439.1739 473.3196 498.1161 524.9749 533.2037 543.3294 593.5843 619.8832 633.4428 646.8135 655.0869 672.0431 695.0942 696.4878 700.6368 734.6284 737.7951 739.4090 784.2193 790.4835 796.4960 810.7789 832.3972 832.7056 847.7916 918.6489 926.8571 928.2641 950.6992 958.2973 968.9195 987.0515 988.1553 997.4654 999.2569 1013.7533 1024.4617 1034.7944 1035.4857 1041.7380 1084.2261 1089.6529 1118.3804 1132.6996 1141.3163 1173.6157 1182.2796 1202.9050 1211.8025 1219.1550 1245.0172 1255.8659 1256.5862 1257.5786 1277.3551 1288.2826 1291.0335 1322.1489 1343.1741 1352.0054 1352.9867 1372.7528 1377.8616 1392.4469 1395.5894 1429.7489 1442.9727 1459.6076 1461.1959 1469.5927 1485.8653 1504.4728 1509.7550 1524.8611 1550.0943 1575.3308 1585.6564 1612.9472 1618.4628 1628.6720 2956.5844 3016.7802 3021.7684 3063.0671 3063.3637 3072.6364 3078.0811 3119.9682 3146.5495 3147.4911 3148.1219 3153.5534 3157.2871 3160.9700 3168.2396 3170.9389 3188.4974 3386.6159
redmass: 10.4910 7.7552 11.8714 14.1173 9.1085 9.8651 5.7041 11.4199 4.2723 7.2744 3.5989 3.5573 2.6431 6.1573 7.8455 5.5660 5.8413 4.0854 4.7620 6.2757 4.4515 4.2043 5.0006 4.2568 9.6121 5.5479 4.8600 4.2687 4.1242 3.1857 3.6414 6.2115 4.7662 5.1697 3.0042 5.1129 3.5709 4.9381 1.2988 7.0753 6.8072 5.8951 6.7851 2.3872 9.4480 5.5186 6.0445 3.8103 4.2536 1.1337 1.2004 7.6290 1.3255 1.4566 1.5348 5.4699 4.5590 1.6224 1.4683 2.8162 1.4934 1.3827 1.3557 6.0135 2.8296 1.4291 1.3723 6.2303 4.2434 2.3429 1.9642 1.6946 1.9381 1.5592 2.6747 1.5457 1.1610 1.6126 1.1527 6.4664 2.0860 3.2220 1.3424 1.2383 1.3349 1.3179 1.3036 1.1818 1.5501 1.6836 1.3121 1.3739 10.3747 3.8088 1.9448 6.8441 3.3022 3.5623 1.1037 1.1052 2.5710 1.0973 1.2121 1.6667 2.6119 6.7706 6.9230 5.3849 6.8806 8.0806 6.3770 1.0867 1.0601 1.0608 1.0571 1.0578 1.1032 1.1039 1.0891 1.0991 1.1090 1.1025 1.0881 1.0915 1.0935 1.0963 1.0943 1.0971 1.0751
irintensity: 0.7166 0.1840 0.0217 1.0973 4.5871 1.4492 1.5883 2.4686 1.1009 6.5968 5.1842 2.9164 0.4884 0.5630 8.3107 0.4046 5.8778 9.6885 3.8682 2.4169 13.4243 8.6387 7.8353 3.4226 0.9773 13.8662 2.8424 5.2460 1.0026 1.0545 1.5580 7.0355 2.1008 0.4732 17.7350 0.8108 14.8188 0.3334 74.8760 2.9522 8.4369 3.3066 111.1259 63.6387 35.5362 86.8292 3.8327 4.8852 7.6643 2.1565 10.3303 17.8760 15.2728 42.5295 33.7104 2.1242 29.7216 2.3911 33.5709 63.0678 17.4749 1.6743 2.6542 1.5607 1.4147 4.3883 3.8762 13.5966 0.7115 0.2803 1.5631 93.9201 24.6409 36.5831 72.0361 32.4325 49.7430 155.4917 101.1130 345.8208 32.8042 119.8945 36.3967 8.7162 85.3745 68.6591 1.8133 7.8303 17.7948 13.9342 28.1605 112.5509 113.8775 29.1495 114.5271 0.4343 7.7882 31.8646 11.3335 16.6545 94.2969 27.3549 53.0139 414.9409 70.8993 49.9368 101.2807 117.4848 48.7472 242.5252 419.1748 62.4585 21.9705 30.1031 4.1363 25.8575 8.8512 7.5018 13.8430 7.3082 21.5736 5.0114 7.5733 6.1559 25.5416 17.3747 7.7825 2.9074 27.3270
temp: 298.150 k
press: 1.00000 atm
elementType: 17 17 8 8 8 7 7 7 7 6 6 6 6 6 6 6 6 6 6 6 6 6 6 6 6 6 6 1 1 1 1 1 1 1 1 1 1 1 1 1 1 1 1 1 1
symmnumber: 1
zpe: 884682.9 jmol-1
zpe.correction: 0.336958 hartree
zpe.thermalcorrener: 0.362968 hartree
zpe.thermalcorrenthalpy: 0.363912 hartree
zpe.thermalcorrgfe: 0.274268 hartree
zpe.sumelectzpe: -2059.451932 hartree
zpe.sumelectthermal: -2059.425922 hartree
zpe.sumelectthermalent: -2059.424977 hartree
zpe.sumelectthermalfe: -2059.514622 hartree
dipole: 2.2862 -0.8474 -1.5358
dipole: 2.8816
quadrupole: -181.4144 -195.4334 -173.9199
quadrupole: -18.9232 17.3343 1.2708
quadrupole: 2.1749 -11.8442 9.6693 -18.9232 17.3343 1.2708
hfenergy: -2059.7888896 hartree
pointgroup: C01 [X(C18H18Cl2N4O3)]
dipole: -0.9440006 -0.5941971 0.2026156 debye
polarizability: 606.0411374|-27.8618951|170.453419|24.4156538|67.9854281|244.4660263 unknown
InChI: InChI=1S/C18H18Cl2N4O3/c19-8-10-23(11-9-20)16-6-4-14(5-7-16)13-21-22-18(25)15-2-1-3-17(12-15)24(26)27/h1-7,12-13,22H,8-11H2
charge 0 multiplicity 1
45 atoms
Cl -7.188422 3.500603 2.043508
Cl -8.266538 -2.496416 -2.069199
O  2.698608 0.829257 2.181308
O  7.931797 -1.467504 -2.223117
O  5.782232 -1.322385 -2.970612
N  -5.823098 0.222468 -0.104191
N  0.690614 -0.085131 0.445729
N  2.037572 -0.364328 0.269379
N  6.676957 -1.230488 -2.042757
C  -6.428431 1.025522 0.974629
C  -6.740492 -0.350785 -1.105714
C  -4.431755 0.011706 -0.176393
C  -3.85592 -0.811329 -1.194485
C  -3.539264 0.614726 0.770886
C  -6.401109 2.526963 0.629376
C  -7.114951 -1.800657 -0.742582
C  -1.585902 -0.414631 -0.316412
C  -2.467331 -1.011469 -1.257787
C  -2.157402 0.403045 0.701464
C  -0.14716 -0.644008 -0.408186
C  4.423884 -0.183766 0.813011
C  4.861298 -0.562276 -0.478028
C  6.230135 -0.833121 -0.68211
C  5.377436 -0.063522 1.859305
C  2.989617 0.152654 1.15722
C  7.18601 -0.733793 0.350776
C  6.741599 -0.339614 1.630678
H  -5.91403 0.848771 1.935187
H  -7.476511 0.70777 1.115918
H  -7.6593 0.260189 -1.146729
H  -6.294236 -0.316739 -2.11508
H  -4.48591 -1.303157 -1.940912
H  -3.924009 1.257791 1.567724
H  -6.996839 2.760079 -0.26577
H  -5.379171 2.917935 0.523611
H  -7.672985 -1.862833 0.203461
H  -6.241923 -2.468298 -0.718376
H  -2.060046 -1.648779 -2.053037
H  -1.488883 0.870606 1.431633
H  0.199367 -1.306584 -1.229686
H  4.195899 -0.621637 -1.344962
H  5.017158 0.260797 2.840868
H  8.235494 -0.953469 0.138684
H  7.46146 -0.246042 2.449569
H  2.339179 -0.998015 -0.485896
