program: Gaussian 09
title: 000265423
version: EM64L-G09RevD.01
frameworkgroup: C1[X(C10H14N3O5P)]
method: RPBEPBE
basis: SDD
operation: Freq
keyword: #p
keyword: freq=noraman
keyword: PBEPBE/SDD
title: #p freq=noraman PBEPBE/SDD
converged: YES YES NO NO
title: Mulliken charges:
elementType: P O O O O O N N N C C C C C C C C C C H H H H H H H H H H H H H H
charge: 1.358296 -0.474502 -0.449357 -0.550674 -0.182395 -0.191220 0.130460 -0.752391 -0.002573 0.207973 -0.321229 -0.335866 -0.678579 -0.465328 0.504301 -0.319786 -0.343997 -0.326953 -0.319266 0.273437 0.206971 0.218840 0.275560 0.248417 0.254954 0.225309 0.349532 0.247859 0.251653 0.230736 0.239471 0.244549 0.245801
chargesum: 0.00000
title: Mulliken charges with hydrogens summed into heavy atoms:
elementType: P O O O O O N N N C C C C C C C C C C
charge: 1.358296 -0.474502 -0.449357 -0.550674 -0.182395 -0.191220 0.130460 -0.402858 -0.002573 0.207973 0.159178 0.158534 0.050100 0.034184 0.504301 -0.089050 -0.104526 -0.082404 -0.073464
polarizability: 1.90153506e+02 -8.94198963e+00 1.66862927e+02 1.34557712e+01 7.91969688e+00 1.28569703e+02
1716.lowfreq: -8.4297 -4.3409 -0.0014 -0.0006 0.0009 8.7494 11.4960 20.9882 35.5842
frequency: 10.9528 18.9565 35.5589 38.6536 55.1056 60.3662 99.1225 140.6950 144.6805 196.9476 211.9538 233.3666 246.0474 255.3162 273.1357 308.8499 314.4564 348.2829 357.1565 366.6120 387.7609 405.3724 407.2091 493.1312 509.9328 516.3827 525.8831 546.8453 578.6105 623.0306 659.3290 664.3748 683.1043 747.8607 761.9320 783.3715 801.3451 837.1334 849.8146 885.7731 892.4412 938.7328 956.1222 960.0149 969.1640 973.3538 976.4139 986.0295 1014.4291 1056.6799 1062.9613 1084.6674 1085.3958 1095.3860 1152.1868 1204.1264 1204.7528 1216.0223 1216.3348 1228.3995 1273.4263 1285.2743 1308.3805 1328.7701 1345.8848 1348.7439 1367.4123 1396.4882 1399.9252 1403.7739 1408.9896 1434.8263 1440.5746 1465.3754 1469.9632 1479.3406 1481.2786 1562.3590 1586.8248 2982.7511 2990.6422 2997.6772 3002.0180 3051.2883 3099.8637 3107.5122 3112.0770 3114.8765 3127.7891 3128.3642 3147.7733 3154.3172 3520.1092
redmass: 5.1759 5.4830 10.6391 4.3905 5.0821 7.0198 6.5777 5.7265 7.9332 1.0819 6.7206 3.7001 3.4004 3.9151 5.1350 3.1861 4.0569 3.5111 2.8409 2.4766 5.2374 5.7839 6.4093 1.9922 4.2894 3.7037 3.2937 5.5107 4.0113 6.4017 7.9897 7.0066 6.4008 3.7320 11.4773 2.7513 2.5589 3.1812 2.1496 1.3190 1.7808 3.5541 1.5480 6.3411 1.9662 2.3183 1.5158 1.8046 2.0400 4.8720 2.4611 1.9572 3.2685 5.3660 2.2199 1.2083 1.3126 1.6382 5.4487 2.3446 2.0402 1.2419 5.4990 1.3787 1.2320 1.2232 1.2550 1.2342 1.2419 1.9076 2.4099 1.5213 1.1201 1.9751 1.0817 1.0965 1.0508 6.7298 5.7093 1.0629 1.0654 1.0491 1.0522 1.1007 1.1002 1.1009 1.0977 1.0992 1.0865 1.0890 1.0962 1.0995 1.0759
irintensity: 4.4942 6.3543 0.4040 0.5444 0.3122 0.5426 0.7794 1.0111 3.4802 0.4241 2.9827 2.2812 3.3680 2.3254 3.9140 2.9572 2.0395 7.3870 32.9987 0.0983 42.8331 4.7474 6.9988 57.3727 14.3681 6.3878 28.8622 5.9338 9.4471 92.7859 61.5682 24.5276 13.9934 19.4440 38.9197 99.3101 60.4387 14.9129 43.7272 1.3209 12.0907 12.0871 3.7703 3.0865 38.1443 125.1736 2.5656 5.5515 108.5505 79.7059 22.1822 24.7508 10.1529 130.9372 6.5395 11.5388 8.7459 9.3431 61.8726 19.9272 1.2426 4.3480 2.8423 2.8677 7.2330 6.1063 1.7725 33.4254 27.3902 8.4216 133.0904 22.2930 14.2295 4.8720 5.8430 9.5767 18.7721 10.9139 32.4832 36.9009 11.4953 6.3201 50.5158 8.0356 11.8318 4.9634 2.1101 2.3519 2.4780 10.9349 51.8619 0.1110 22.1324
temp: 298.150 k
press: 1.00000 atm
elementType: 15 8 8 8 8 8 7 7 7 6 6 6 6 6 6 6 6 6 6 1 1 1 1 1 1 1 1 1 1 1 1 1 1
symmnumber: 1
zpe: 645880.0 jmol-1
zpe.correction: 0.246003 hartree
zpe.thermalcorrener: 0.264965 hartree
zpe.thermalcorrenthalpy: 0.265909 hartree
zpe.thermalcorrgfe: 0.195188 hartree
zpe.sumelectzpe: -1269.504105 hartree
zpe.sumelectthermal: -1269.485142 hartree
zpe.sumelectthermalent: -1269.484198 hartree
zpe.sumelectthermalfe: -1269.554919 hartree
dipole: 4.3282 -4.5383 3.0120
dipole: 6.9572
quadrupole: -148.1922 -126.5399 -117.9121
quadrupole: 25.0260 -4.3078 3.5202
quadrupole: -17.3108 4.3415 12.9693 25.0260 -4.3078 3.5202
hfenergy: -1269.7501075 hartree
pointgroup: C01 [X(C10H14N3O5P1)]
dipole: 1.7214675 1.6621846 -1.3288267 debye
polarizability: 190.3014743|7.5493758|167.7056936|-14.169396|4.8715639|127.5789676 unknown
InChI: InChI=1S/C10H14N3O5P/c1-10(13(14)15)7-17-19(16,18-8-10)12-6-9-2-4-11-5-3-9/h2-5,12H,6-8H2,1H3
charge 0 multiplicity 1
33 atoms
P  -0.962899 -1.73431 0.275355
O  -1.895598 -1.319789 -1.135807
O  -1.375137 -0.468604 1.409638
O  -1.248436 -3.1619 0.88015
O  -4.680476 0.226827 -0.628139
O  -4.155447 1.235477 1.344456
N  -3.859756 0.790621 0.178067
N  0.636785 -1.311387 -0.259612
N  4.846451 1.542681 -0.249835
C  -2.391916 1.055724 -0.326809
C  -2.058135 0.107974 -1.498893
C  -1.42112 0.903871 0.865696
C  -2.390245 2.521718 -0.824279
C  1.81792 -1.505979 0.623001
C  2.875703 -0.45122 0.333121
C  2.746534 0.874407 0.819344
C  4.019351 -0.75476 -0.44429
C  3.743438 1.824836 0.509603
C  4.966188 0.262953 -0.710569
H  -2.876844 0.100815 -2.233927
H  -1.125391 0.477491 -1.969224
H  -0.413322 1.21147 0.521023
H  -1.749636 1.523567 1.7131
H  -3.081747 2.649177 -1.674957
H  -2.7014 3.202442 -0.014093
H  -1.376405 2.808774 -1.153688
H  0.81121 -1.400363 -1.265852
H  2.243642 -2.521682 0.503229
H  1.468023 -1.420136 1.66811
H  1.891696 1.15746 1.444262
H  4.18091 -1.766803 -0.833164
H  3.674905 2.85331 0.881831
H  5.859253 0.054441 -1.310449
