program: Gaussian 09
title: 000265399
version: EM64L-G09RevD.01
frameworkgroup: C1[X(C9H8N2O2)]
method: RPBEPBE
basis: SDD
operation: Freq
keyword: #pfreq=noraman
keyword: PBEPBE/SDD
title: #p freq=noraman PBEPBE/SDD
converged: NO NO NO NO
title: Mulliken charges:
elementType: O O N N C C C C C C C C C H H H H H H H H
charge: -0.456656 -0.239333 -0.236872 -0.002122 0.110400 0.403658 -0.328385 0.411311 -0.265158 -0.272336 -0.804110 -0.486550 0.000770 0.299937 0.274970 0.247856 0.242827 0.230547 0.238152 0.238139 0.392956
chargesum: 0.00000
title: Mulliken charges with hydrogens summed into heavy atoms:
elementType: O O N N C C C C C C C C C
charge: -0.063700 -0.239333 -0.236872 -0.002122 0.110400 0.403658 -0.028448 0.411311 0.009812 -0.024481 -0.097272 -0.243724 0.000770
polarizability: 2.01689137e+02 -9.17925776e-01 1.22122468e+02 1.37758752e-05 -1.06923268e-03 5.08031932e+01
1716.lowfreq: -0.0005 0.0001 0.0004 4.6305 8.7708 15.3464 60.7831 129.2377 156.4795
frequency: 60.7527 129.2091 156.4776 166.4239 204.5463 220.1400 324.5225 338.1036 356.4790 380.8064 409.7604 418.2317 503.8210 527.0458 533.8109 574.0738 605.3768 626.6127 690.5481 705.0274 739.9900 808.8890 832.5251 843.1630 880.2480 898.5940 921.4287 989.6553 1007.8510 1029.0679 1052.5123 1130.1913 1139.2952 1173.0314 1210.0694 1226.4743 1252.3014 1278.3772 1353.8640 1405.9508 1408.2668 1444.0997 1467.9615 1478.1452 1506.1325 1552.0845 1590.2557 1642.4116 1661.5494 2978.8690 3056.3355 3091.7239 3139.8408 3157.2792 3194.3662 3202.9006 3609.0863
redmass: 5.3817 1.2990 3.3502 3.3326 4.8301 3.8395 3.7390 6.6307 4.2348 1.2133 3.3189 6.1955 7.7174 6.1610 2.7048 6.3698 6.6725 6.4087 4.0823 5.4671 4.4162 6.4832 1.4817 1.6335 1.3452 3.2068 6.5463 1.2978 2.0299 2.3167 1.4985 1.7766 1.4362 4.9856 1.6734 2.6462 1.9690 3.1216 1.6513 1.7242 1.8471 2.9632 1.0445 1.1412 5.4539 6.9127 9.1229 8.7662 6.4993 1.0374 1.0980 1.0987 1.0909 1.0927 1.0954 1.0937 1.0662
irintensity: 1.2676 2.3436 0.4705 2.6639 0.0179 0.8565 0.6103 9.5863 8.4709 164.1943 2.9250 2.8805 0.2958 4.7701 10.5075 6.6414 10.6536 3.3729 1.0342 2.3160 0.0000 7.3849 60.1892 43.4459 8.4554 2.7571 3.8216 1.5074 39.2517 31.4748 12.3191 132.7398 79.1949 88.6512 22.9731 24.5076 12.0789 38.0528 5.7726 37.8806 4.4004 69.8826 14.5989 3.2493 278.7755 46.0098 152.0128 527.1049 45.2068 37.2869 17.5733 15.3812 11.6276 4.5218 0.4750 6.3981 63.5744
temp: 298.150 k
press: 1.00000 atm
elementType: 8 8 7 7 6 6 6 6 6 6 6 6 6 1 1 1 1 1 1 1 1
symmnumber: 1
zpe: 408444.3 jmol-1
zpe.correction: 0.155568 hartree
zpe.thermalcorrener: 0.166382 hartree
zpe.thermalcorrenthalpy: 0.167326 hartree
zpe.thermalcorrgfe: 0.119208 hartree
zpe.sumelectzpe: -606.772554 hartree
zpe.sumelectthermal: -606.761741 hartree
zpe.sumelectthermalent: -606.760797 hartree
zpe.sumelectthermalfe: -606.808915 hartree
dipole: -7.1174 5.0024 -0.0005
dipole: 8.6995
quadrupole: -85.4646 -66.5216 -77.4168
quadrupole: 18.8848 -0.0024 -0.0002
quadrupole: -8.9970 9.9461 -0.9492 18.8848 -0.0024 -0.0002
hfenergy: -606.9281225 hartree
pointgroup: C01 [X(C9H8N2O2)]
dipole: 2.7232541 2.0732516 0.005585 debye
dipolederiv: -0.2088463 -0.2335635 -0.0001405 -0.1284111 -1.3274661 -0.0012597 0.0000417 -0.0012585 -0.4131687 -1.4821317 -0.2698629 -0.0013613 -0.316835 -0.5174897 -0.0004482 -0.0018283 -0.0005039 -0.3817419 -0.8712287 0.2790855 -0.0005845 -0.2956109 -0.6577504 -0.0011914 -0.0013623 -0.0006298 0.0625216 -1.6522739 -0.1872851 -0.0016501 0.2417646 -0.3729695 0.0001636 -0.0011373 -0.0003331 -0.2678593 1.3122871 0.3575534 0.0016594 0.3658439 0.4193777 0.0007599 0.0017537 0.0007812 0.0968944 0.2714493 0.2486203 0.0006323 -0.0221182 -0.2557992 -0.0002716 0.0001794 -0.0000031 -0.0611423 0.3273464 -0.3389346 -0.0000153 0.1856727 0.0159013 0.0003078 0.0006488 -0.0002348 -0.0872967 0.8484123 0.078451 0.0008269 -0.0878085 1.4019147 0.0014615 0.0006694 0.0015683 0.133765 -0.4646477 -0.1487405 -0.0005064 0.1264916 0.0881588 0.000448 -0.0000616 0.0001988 -0.1610495 0.1119729 -0.0201966 0.0001867 0.0332845 0.3149966 0.0005988 0.0002662 0.0005494 -0.1177982 -0.0865714 -0.0289427 -0.0001832 0.0295582 0.0546702 0.0000252 0.0000225 -0.0000384 0.0650834 -0.4327188 -0.3066215 -0.0005592 -0.3476577 -0.5096029 -0.0007603 -0.0006239 -0.0006106 -0.22554 2.0407428 0.3344658 0.002219 0.1295814 0.8062789 0.0008263 0.002212 0.0010315 0.2174532 0.1000339 -0.0361516 -0.0001369 -0.0512457 0.0566326 -0.0002154 -0.0001611 -0.0002087 0.1869801 0.0788222 -0.0459304 -0.0001468 -0.0004953 0.0089721 -0.0002062 -0.0000731 -0.0002454 0.1673869 -0.028762 0.1065908 -0.0000398 0.088915 0.0320922 -0.000071 -0.0000738 -0.0000518 0.1506924 0.0529262 0.0731941 -0.0000511 0.0881688 -0.0291792 -0.0001596 -0.0000456 -0.0001606 0.1849232 0.073876 0.0500782 0.0000423 -0.072515 -0.1294584 -0.0004743 -0.0001631 -0.000331 0.1138542 -0.0411589 0.0025918 0.0745117 0.0171061 0.0813477 -0.0819138 0.1339316 -0.0490308 -0.0349388 -0.0407282 0.0027454 -0.0745196 0.0174216 0.0809 0.0823364 -0.1338949 0.0494074 -0.0348688 0.0911985 0.0828528 -0.0001837 -0.001111 0.4384726 0.0000441 -0.0003004 0.0001041 0.4058498 unknown
polarizability: 201.5038379|3.9418153|122.3074842|0.1584374|0.0951803|50.8034759 unknown
InChI: InChI=1S/C9H8N2O2/c1-6-2-3-7-10-8(12)4-9(13)11(7)5-6/h2-5,13H,1H3
charge 0 multiplicity 1
21 atoms
O  -0.553916 2.67098 0.002317
O  -3.72836 -1.020856 -0.005692
N  0.146095 0.449771 0.000399
N  -1.411684 -1.450898 -0.003615
C  -0.173859 -0.964278 -0.001703
C  2.545501 0.055292 0.002274
C  1.468463 0.921147 0.002306
C  -0.947133 1.334307 0.00034
C  0.97395 -1.844331 -0.00178
C  2.270787 -1.365129 0.000139
C  3.969367 0.571082 0.004315
C  -2.237429 0.867746 -0.001579
C  -2.540862 -0.580144 -0.003492
H  1.571593 2.006677 0.003765
H  0.739618 -2.910998 -0.003419
H  3.111226 -2.068695 0.000042
H  -3.083181 1.563705 -0.001704
H  4.003643 1.673622 0.006151
H  4.521799 0.215524 -0.88567
H  4.520299 0.212584 0.894045
H  -1.344317 3.264291 0.00236
