program: Gaussian 09
title: 000265390
version: EM64L-G09RevD.01
frameworkgroup: C1[X(C4H6F3NO)]
method: RPBEPBE
basis: SDD
operation: Freq
keyword: #p
keyword: freq=noraman
keyword: PBEPBE/SDD
title: #p freq=noraman PBEPBE/SDD
converged: YES YES NO NO
title: Mulliken charges:
elementType: F F F O N C C C C H H H H H H
charge: -0.148125 -0.186777 -0.146667 -0.454328 -0.120836 -0.403428 -0.399738 -0.209434 0.420504 0.246328 0.265183 0.251050 0.245611 0.269809 0.370847
chargesum: 0.00000
title: Mulliken charges with hydrogens summed into heavy atoms:
elementType: F F F O N C C C C
charge: -0.148125 -0.186777 -0.146667 -0.083481 -0.120836 0.108083 0.096923 0.060375 0.420504
polarizability: 6.05251809e+01 -5.55381879e+00 5.26540690e+01 6.60678146e-01 -1.32000909e+00 4.89703704e+01
1716.lowfreq: -10.0070 -0.0009 -0.0008 0.0003 4.1486 7.9297 60.5617 95.7067 154.2333
frequency: 60.5101 95.6790 154.2331 220.5840 249.5457 269.3684 298.3713 333.5307 364.7266 455.3240 498.0923 547.7931 624.7541 740.3367 783.4272 815.1946 847.1741 911.2588 985.5321 1004.7524 1032.1158 1050.1680 1084.6175 1117.4265 1135.1614 1147.3569 1171.8194 1206.2194 1303.8658 1313.0916 1351.9025 1446.7353 1465.8163 3004.7100 3087.4197 3099.6841 3194.5876 3214.5407 3561.2541
redmass: 7.1326 3.7717 4.6165 5.8345 2.9075 1.3019 5.5969 5.7833 8.1448 12.2568 11.7299 5.0609 10.3394 4.2832 6.2922 1.0919 5.9004 7.8369 1.8479 1.7954 3.0008 4.7567 1.2531 1.3064 1.6843 1.4040 1.7195 2.9692 1.9460 1.2139 2.2468 1.0781 1.1895 1.0845 1.0502 1.0570 1.1192 1.1187 1.0660
irintensity: 0.2713 2.4124 1.9869 0.2479 44.1557 142.3590 6.0472 4.8091 5.5246 6.3917 0.9650 11.5235 11.9630 50.4925 36.1162 14.6346 39.9447 42.8969 141.6649 113.2669 59.1305 204.9482 15.7973 14.4928 2.3970 16.1921 78.7170 66.7113 84.6287 4.3444 37.0650 6.5113 1.8034 31.4780 21.8189 15.5450 3.2977 14.9254 11.6837
temp: 298.150 k
press: 1.00000 atm
elementType: 9 9 9 8 7 6 6 6 6 1 1 1 1 1 1
symmnumber: 1
zpe: 270647.2 jmol-1
zpe.correction: 0.103084 hartree
zpe.thermalcorrener: 0.112235 hartree
zpe.thermalcorrenthalpy: 0.113179 hartree
zpe.thermalcorrgfe: 0.068747 hartree
zpe.sumelectzpe: -584.746770 hartree
zpe.sumelectthermal: -584.737619 hartree
zpe.sumelectthermalent: -584.736675 hartree
zpe.sumelectthermalfe: -584.781108 hartree
dipole: 1.9623 2.0038 -0.6962
dipole: 2.8897
quadrupole: -51.0686 -49.7772 -51.1615
quadrupole: -3.2387 0.0786 -3.0703
quadrupole: -0.3995 0.8919 -0.4924 -3.2387 0.0786 -3.0703
hfenergy: -584.8498543 hartree
pointgroup: C01 [X(C4H6F3N1O1)]
dipole: 0.6600511 -0.2282035 0.8971237 debye
dipolederiv: -0.4685923 0.2610037 -0.0957933 0.1770216 -0.7094284 0.079504 -0.1133329 0.1337071 -0.3356355 -0.7481326 -0.2395706 0.154403 -0.237063 -0.4706493 0.1418141 0.0601624 0.1062162 -0.4172843 -0.3933137 0.0301403 0.0247587 0.0740828 -0.360036 -0.1925378 0.093356 -0.2049933 -0.6895364 -0.3254392 0.019571 -0.1595799 -0.1922665 -0.879193 0.2094109 -0.0727328 0.1606906 -0.6067087 -0.9771291 -0.0574596 0.1570925 -0.0028671 -0.4314077 0.1610106 0.145327 0.1681759 -0.201818 0.1880526 -0.0165193 -0.0845623 -0.0033627 0.1169234 -0.107466 -0.0495414 -0.1290602 0.1423017 0.2363152 0.0743607 0.0205725 0.0274748 0.2350468 -0.0612776 -0.0399868 -0.0437058 -0.02367 0.6541691 0.1101606 -0.1050108 0.3352162 0.8249583 -0.3258729 -0.2218566 -0.2487635 0.4405269 1.4959424 -0.0128775 -0.0983084 -0.0596983 1.4097871 0.007163 -0.0421561 -0.0108826 1.3348433 0.0842883 -0.0123245 0.0495555 -0.017082 0.0514518 0.0478784 0.0999359 0.033638 -0.071407 0.1070667 -0.0238704 0.0395513 0.0217438 -0.0552095 -0.0418897 0.0198608 -0.0072389 0.0746641 0.0525337 -0.0331816 -0.0386274 0.031414 0.04782 0.0962221 -0.0641238 0.0697601 -0.0153168 0.0011514 -0.0851249 -0.0413351 -0.124461 -0.038173 -0.0204933 -0.0552984 -0.0089866 0.0751335 -0.0246159 0.0497385 0.0397105 0.0277442 -0.0300294 -0.0258435 0.1037491 -0.0579895 -0.0642007 0.1177034 -0.0640463 0.1375729 -0.0578968 0.288139 0.0323776 0.1366376 0.0394325 0.3581077 unknown
polarizability: 60.9954967|4.5464843|50.0300159|-2.9685259|-1.3784959|51.1241077 unknown
InChI: InChI=1S/C4H6F3NO/c5-4(6,7)3(9)8-1-2-8/h3,9H,1-2H2
charge 0 multiplicity 1
15 atoms
F  -1.709004 1.187472 -0.601216
F  -2.188642 -0.866605 0.237121
F  -0.777295 -0.657595 -1.532131
O  0.376918 -1.327981 1.162361
N  1.13383 0.718218 0.102429
C  2.182239 -0.065718 -0.639135
C  2.501143 0.573797 0.708915
C  0.018687 0.031301 0.710683
C  -1.141016 -0.064395 -0.314336
H  2.524261 0.40656 -1.564231
H  2.081127 -1.15514 -0.659464
H  2.610882 -0.108434 1.559247
H  3.080672 1.500474 0.753649
H  -0.354278 0.639687 1.55928
H  -0.395627 -1.758138 1.61083
