program: Gaussian 09
title: 000024514
version: EM64L-G09RevD.01
frameworkgroup: C1[X(C11H22O3)]
method: RPBEPBE
basis: SDD
operation: Freq
keyword: #pfreq=noraman
keyword: PBEPBE/SDD
title: #p freq=noraman PBEPBE/SDD
converged: YES YES NO NO
title: Mulliken charges:
elementType: O O O C C C C C C C C C C C H H H H H H H H H H H H H H H H H H H H H H
charge: -0.440251 -0.416720 -0.240627 -0.365938 -0.456303 -0.380186 -0.054891 -0.373567 -0.435279 -0.352957 -0.356528 -0.474451 -0.696429 0.173992 0.192868 0.220389 0.200118 0.205343 0.189739 0.191946 0.210922 0.190432 0.192163 0.217948 0.230894 0.187271 0.187544 0.195019 0.195382 0.279914 0.248873 0.323710 0.209649 0.209564 0.215546 0.374899
chargesum: 0.00000
title: Mulliken charges with hydrogens summed into heavy atoms:
elementType: O O O C C C C C C C C C C C
charge: -0.116541 -0.041821 -0.240627 0.047319 -0.050841 0.001500 0.156031 0.009029 0.013564 0.021857 0.033874 0.054336 -0.061670 0.173992
polarizability: 1.72569222e+02 -1.86984140e-02 1.13600758e+02 2.09371002e+00 4.80829599e+00 1.05738270e+02
1716.lowfreq: -38.1175 -6.7545 -2.8923 -0.0007 -0.0003 0.0010 14.9933 19.1416 31.7802
frequency: -20.9101 17.6809 31.7682 35.1878 49.1192 78.4335 84.7854 90.1112 125.9315 136.8530 143.3992 156.6224 184.7362 234.9283 253.1864 276.0355 333.4629 349.0488 401.0980 431.8091 451.2032 504.1714 516.5057 539.2336 604.6491 650.3301 719.0189 727.9370 754.1051 761.7782 806.5520 848.2745 875.0098 888.5218 909.4237 976.5944 988.1914 1000.5834 1011.6816 1028.5934 1049.2289 1065.4768 1070.1055 1076.5780 1083.8983 1091.4378 1106.8003 1126.1677 1151.4121 1186.4251 1211.8316 1222.1470 1231.9433 1247.4280 1256.2445 1266.9381 1279.7616 1285.6683 1288.4951 1293.1647 1312.9489 1321.3175 1335.3244 1350.3314 1354.1236 1360.3333 1363.5050 1375.0864 1389.1921 1441.3097 1450.9268 1459.8758 1460.5655 1465.1849 1467.5083 1475.3777 1477.8873 1482.9704 1487.5852 1662.6037 2944.6929 2947.6988 2949.0072 2955.4251 2964.8725 2967.5669 2970.8052 2981.7538 2982.4863 2987.5843 2991.2955 3000.2626 3011.1171 3019.0427 3029.8341 3040.4493 3046.2234 3066.7720 3066.9645 3069.8941 3509.9270 3532.0067
redmass: 2.0678 4.2661 5.0638 3.6591 3.6119 2.4717 3.2832 2.1169 2.4745 1.9984 2.3541 4.1538 4.5326 1.1051 3.9803 3.8073 1.1930 2.8952 3.1601 2.5928 2.8040 2.1367 3.4543 2.4485 3.4173 1.4820 1.0629 1.0969 1.1971 1.6050 1.4295 2.2854 2.8663 1.8928 1.4055 1.5344 3.5788 2.2991 1.7305 3.7530 2.4442 2.0072 1.7486 2.4453 2.2087 2.2672 1.7343 3.0067 1.3284 1.7508 1.3084 1.4119 1.3349 1.3636 1.3736 1.2196 1.0495 1.2790 1.1307 1.1185 1.4119 1.2526 1.4771 1.5711 1.6669 1.6030 1.2518 1.7248 1.2171 1.0800 1.0860 1.0713 1.0730 1.0822 1.0793 1.0783 1.0442 1.0842 1.0875 8.1112 1.0612 1.0598 1.0589 1.0593 1.0600 1.0603 1.0365 1.0962 1.0634 1.0629 1.0981 1.0933 1.1011 1.0904 1.1039 1.1014 1.0994 1.0982 1.1003 1.0993 1.0638 1.0656
irintensity: 0.2987 0.0626 0.1008 2.2131 0.1703 0.0029 0.4848 0.1716 1.9176 0.3059 4.1938 3.3486 2.5476 0.0156 0.8692 0.0551 158.7117 3.9612 24.3054 7.1299 4.6793 10.2142 67.1109 20.6832 15.3974 115.2523 13.0910 0.0955 0.8815 2.6847 10.1468 16.5018 14.0983 4.8812 21.6034 0.4736 12.7987 25.7135 14.8907 81.9707 104.0522 6.5922 51.8359 26.5772 2.2375 19.3880 12.6839 32.7833 3.8002 0.2541 34.3422 13.9120 4.2714 4.1617 6.7194 1.3390 0.1968 5.1024 1.6480 1.9497 15.6998 3.3245 24.1423 15.4702 1.4597 10.0311 26.2965 27.0681 11.3635 19.6954 4.2341 0.0927 0.8057 14.8213 5.0213 2.1597 11.9253 5.3059 26.1940 208.0031 4.6639 9.7595 2.5710 19.9635 12.5070 156.7636 36.3396 2.0526 11.6714 23.9069 2.4717 8.9883 3.2006 19.3127 23.2463 39.0475 113.9675 8.0810 126.6224 54.6330 19.6227 3.9718
temp: 298.150 k
press: 1.00000 atm
elementType: 8 8 8 6 6 6 6 6 6 6 6 6 6 6 1 1 1 1 1 1 1 1 1 1 1 1 1 1 1 1 1 1 1 1 1 1
symmnumber: 1
zpe: 826005.6 jmol-1
zpe.correction: 0.314609 hartree
zpe.thermalcorrener: 0.331807 hartree
zpe.thermalcorrenthalpy: 0.332751 hartree
zpe.thermalcorrgfe: 0.266637 hartree
zpe.sumelectzpe: -656.887237 hartree
zpe.sumelectthermal: -656.870039 hartree
zpe.sumelectthermalent: -656.869095 hartree
zpe.sumelectthermalfe: -656.935209 hartree
dipole: 0.7504 0.4548 -0.6402
dipole: 1.0862
quadrupole: -86.8278 -96.9727 -84.5881
quadrupole: 2.1822 3.0584 -1.3342
quadrupole: 2.6351 -7.5099 4.8748 2.1822 3.0584 -1.3342
hfenergy: -657.2018461 hartree
pointgroup: C01 [X(C11H22O3)]
dipole: -0.2926728 0.2010905 0.2377501 debye
polarizability: 172.5851247|-0.2921374|112.7700571|1.7572333|-5.3964758|106.5530684 unknown
InChI: InChI=1S/C11H22O3/c1-2-3-4-5-6-7-10(12)8-9-11(13)14/h10,12-13H,2-9H2,1H3
charge 0 multiplicity 1
36 atoms
O  1.445486 -1.473407 -0.935665
O  6.352416 -0.37499 0.488798
O  5.341996 1.270724 -0.796301
C  -1.174306 -0.39817 0.215819
C  0.127356 0.411754 0.032808
C  -2.448881 0.437181 -0.03623
C  1.404307 -0.447496 0.137433
C  -3.753021 -0.361619 0.185176
C  2.695338 0.398847 0.119843
C  -5.031282 0.462282 -0.088522
C  -6.334943 -0.33661 0.138512
C  3.953184 -0.475492 0.283216
C  -7.607667 0.49252 -0.138256
C  5.229581 0.252642 -0.07622
H  -1.203535 -0.811024 1.245817
H  -1.156056 -1.270068 -0.467547
H  0.118253 0.921252 -0.955891
H  0.174363 1.217038 0.794351
H  -2.448078 1.327423 0.627977
H  -2.43169 0.827082 -1.075948
H  1.365926 -1.061702 1.057486
H  -3.777634 -0.740489 1.228543
H  -3.748139 -1.25825 -0.469585
H  2.649814 1.153429 0.928646
H  2.761196 0.963073 -0.831475
H  -5.036318 1.361598 0.562989
H  -5.010419 0.837123 -1.133545
H  -6.355277 -0.710636 1.182679
H  -6.329029 -1.235115 -0.512197
H  3.86385 -1.355833 -0.386492
H  4.048098 -0.879546 1.306922
H  1.397704 -1.002126 -1.808221
H  -7.624527 0.85549 -1.183475
H  -7.656023 1.377926 0.523766
H  -8.524316 -0.103174 0.027193
H  7.173572 0.109066 0.199297
