program: Gaussian 09
title: 000265374
version: EM64L-G09RevD.01
frameworkgroup: C1[X(C11H15N)]
method: RPBEPBE
basis: SDD
operation: Freq
keyword: #pfreq=noraman
keyword: PBEPBE/SDD
title: #p freq=noraman PBEPBE/SDD
converged: YES YES NO NO
title: Mulliken charges:
elementType: N C C C C C C C C C C C H H H H H H H H H H H H H H H
charge: -0.157270 -0.258819 -0.465951 -0.009307 0.471750 -0.695601 -0.690872 -0.418410 -0.397598 -0.232097 -0.228970 -0.244785 0.226603 0.243406 0.217063 0.168342 0.205189 0.226644 0.218504 0.225050 0.202603 0.227007 0.226942 0.269810 0.222606 0.222386 0.225774
chargesum: 0.00000
title: Mulliken charges with hydrogens summed into heavy atoms:
elementType: N C C C C C C C C C C C
charge: -0.157270 -0.032217 -0.005482 0.159035 0.471750 -0.045265 -0.036212 -0.191468 -0.127787 -0.009491 -0.006584 -0.019011
polarizability: 1.67495902e+02 1.44621432e-01 1.14723305e+02 1.06700819e+01 -3.55443807e-01 8.77663423e+01
1716.lowfreq: -7.4529 -0.0008 -0.0007 -0.0004 6.1984 10.7504 37.8260 67.3086 76.3037
frequency: 37.7706 67.2774 76.2686 137.5087 189.3154 204.5326 232.9927 273.1698 281.3889 348.0365 357.7087 405.5886 468.5132 485.7090 532.2590 576.6773 615.9973 689.0363 707.5079 756.9178 775.9834 836.2272 857.0066 871.8016 920.7466 921.1215 943.4998 950.7827 978.1040 983.3802 989.2360 996.0388 1025.5381 1032.2646 1073.8315 1084.7663 1090.9461 1142.7961 1147.0342 1169.7933 1175.5521 1182.4995 1205.8034 1242.1451 1311.7365 1321.2947 1334.7240 1371.8273 1376.6573 1391.8025 1397.0935 1442.9866 1457.4973 1462.9550 1466.9896 1471.2020 1486.2742 1487.4113 1591.3415 1616.6610 2853.0621 2981.2981 2984.6831 3042.2101 3052.0160 3077.7850 3082.3215 3085.1545 3091.0698 3112.1959 3123.6063 3136.7074 3149.4958 3162.1812 3163.5075
redmass: 3.3493 3.7034 2.8904 3.6140 3.0243 1.0748 1.1723 3.1456 2.4572 3.0708 2.6744 2.8618 2.5060 3.5707 2.9499 3.7755 6.4178 3.4977 1.6387 2.5685 1.9346 4.5540 1.2888 3.1523 1.2642 1.2909 2.0627 1.4529 1.4109 1.9345 5.3515 1.3319 2.0641 1.2084 1.4809 1.3567 1.3255 2.2454 2.1832 1.0655 1.7834 1.1750 3.0634 1.5250 1.5394 1.4787 1.3148 2.5542 1.3242 1.5106 1.9929 1.9422 1.0474 1.1907 1.0503 1.0603 1.7530 1.2901 6.1027 6.1243 1.0820 1.0349 1.0356 1.0603 1.0826 1.1000 1.0993 1.1004 1.0995 1.0869 1.0864 1.0919 1.0952 1.1013 1.1142
irintensity: 0.0469 0.7475 0.0971 1.5063 1.8480 0.0658 0.8741 0.3587 1.2582 0.6935 1.3989 0.0280 0.7198 1.9105 9.9811 3.4030 0.0723 9.9457 63.2720 0.3659 40.2310 3.3273 0.5111 7.8486 1.7024 3.7107 6.7903 0.7398 0.7088 15.3850 0.3950 0.6375 10.6999 1.1960 2.5143 16.1917 7.0625 27.0252 1.1150 0.3448 4.4618 1.0599 42.7253 1.1103 19.0732 4.7794 47.5549 4.6181 23.4365 15.1001 5.6202 7.4665 5.7584 5.3799 2.2829 12.6482 7.9263 23.2168 1.0609 15.6728 80.0054 34.1673 20.2348 24.9450 30.6832 21.7685 57.9559 2.9194 61.8833 10.6499 0.6001 26.3452 27.0823 28.6947 16.6465
temp: 298.150 k
press: 1.00000 atm
elementType: 7 6 6 6 6 6 6 6 6 6 6 6 1 1 1 1 1 1 1 1 1 1 1 1 1 1 1
symmnumber: 1
zpe: 604872.7 jmol-1
zpe.correction: 0.230384 hartree
zpe.thermalcorrener: 0.242216 hartree
zpe.thermalcorrenthalpy: 0.243161 hartree
zpe.thermalcorrgfe: 0.192122 hartree
zpe.sumelectzpe: -481.973633 hartree
zpe.sumelectthermal: -481.961801 hartree
zpe.sumelectthermalent: -481.960856 hartree
zpe.sumelectthermalfe: -482.011895 hartree
dipole: -0.9680 -1.2718 -0.3474
dipole: 1.6356
quadrupole: -66.3349 -68.5043 -74.9414
quadrupole: 2.3267 1.6618 0.0008
quadrupole: 3.5920 1.4226 -5.0146 2.3267 1.6618 0.0008
hfenergy: -482.2040171 hartree
pointgroup: C01 [X(C11H15N1)]
dipole: 0.3677889 -0.4283228 -0.3088002 debye
polarizability: 167.0092147|-10.3688066|98.3392399|6.6562347|12.8840949|104.6370947 unknown
InChI: InChI=1S/C11H15N/c1-9(2)12-8-11(12)10-6-4-3-5-7-10/h3-7,9,11H,8H2,1-2H3
charge 0 multiplicity 1
27 atoms
N  1.667359 -0.152504 0.421786
C  0.527918 -0.858396 -0.277194
C  1.290939 -1.53587 0.867958
C  2.945684 -0.030865 -0.352123
C  -0.856383 -0.314097 -0.113901
C  4.109888 0.082079 0.649793
C  2.845007 1.201093 -1.270855
C  -1.889869 -0.727664 -0.993562
C  -1.165027 0.598083 0.928443
C  -3.208069 -0.245549 -0.832593
C  -2.481795 1.080662 1.088705
C  -3.509764 0.659015 0.211803
H  0.746227 -1.271375 -1.275012
H  0.816874 -1.605823 1.852776
H  1.955283 -2.372021 0.602136
H  3.106894 -0.940819 -0.985798
H  5.074468 0.173518 0.118259
H  3.973618 0.973323 1.287897
H  4.156944 -0.806118 1.306277
H  1.998012 1.107362 -1.974462
H  3.773109 1.326444 -1.857813
H  2.685832 2.111078 -0.665369
H  -1.66151 -1.429858 -1.805752
H  -0.353161 0.936135 1.581809
H  -3.996554 -0.572093 -1.520429
H  -2.708162 1.789665 1.893542
H  -4.531568 1.0347 0.337381
