program: Gaussian 09
title: 000265380
version: EM64L-G09RevD.01
frameworkgroup: C1[X(C16H19N3O)]
method: RPBEPBE
basis: SDD
operation: Freq
keyword: #p
keyword: freq=noraman
keyword: PBEPBE/SDD
title: #p freq=noraman PBEPBE/SDD
converged: YES YES NO NO
title: Mulliken charges:
elementType: O N N N C C C C C C C C C C C C C C C C H H H H H H H H H H H H H H H H H H H
charge: -0.292333 -0.089127 -0.425304 -0.492592 -0.418171 -0.414020 -0.397740 -0.353946 -0.378842 0.290077 0.334568 0.150534 0.433125 -0.372557 -0.326289 -0.474809 -0.426526 -0.233524 -0.278725 -0.244975 0.242151 0.213199 0.209098 0.240931 0.215756 0.162609 0.205324 0.239632 0.266640 0.204831 0.282801 0.282523 0.309192 0.179706 0.236954 0.238768 0.225773 0.225971 0.229315
chargesum: 0.00000
title: Mulliken charges with hydrogens summed into heavy atoms:
elementType: O N N N C C C C C C C C C C C C C C C C
charge: -0.292333 -0.089127 -0.142504 -0.210070 0.037180 0.036010 -0.019375 0.091011 0.092629 0.290077 0.334568 0.150534 0.433125 -0.063365 -0.146583 -0.237855 -0.187758 -0.007751 -0.052754 -0.015659
polarizability: 2.83236355e+02 -1.58097254e+01 2.27308145e+02 2.09003000e+01 1.91824183e+01 1.13430047e+02
1716.lowfreq: -3.9875 -1.3619 -0.0007 -0.0006 -0.0004 4.3533 15.0956 21.1025 37.8503
frequency: 12.7062 21.0300 37.8426 42.1434 56.6941 88.1659 99.4609 105.7952 136.0786 169.6972 177.7026 209.5736 255.4142 264.6002 288.2053 349.6696 357.1800 374.0863 416.3531 420.1577 422.5946 471.8482 490.1372 509.8598 515.1444 541.6130 591.3071 614.5800 646.1677 681.3898 703.5249 712.6647 734.0113 747.5523 781.3971 781.8380 790.0925 804.2044 806.1720 822.6504 855.9966 865.2277 882.5102 923.8870 924.5738 947.1540 970.6452 979.6322 984.2682 993.5213 1004.7280 1034.2358 1055.3231 1063.7724 1078.9682 1084.4002 1088.2276 1096.5872 1124.5253 1137.2551 1141.3012 1155.4686 1181.7465 1193.7814 1203.7289 1206.7468 1236.0631 1253.6024 1265.5617 1272.4056 1286.7330 1294.1634 1316.6457 1354.2210 1361.4487 1373.0892 1408.2294 1417.8518 1442.0768 1451.0298 1455.1639 1456.2866 1457.8285 1466.4972 1480.8493 1486.7997 1494.5897 1538.2594 1591.9959 1598.4130 1632.9521 1651.2008 2845.1414 2976.2432 2991.6040 3003.1359 3048.3151 3058.6111 3067.1082 3076.8564 3098.3860 3123.7345 3128.7747 3140.7659 3152.9423 3162.0262 3162.3266 3179.4876 3191.7719 3548.2833 3557.6404
redmass: 4.6093 5.0224 2.5954 6.0533 4.1263 3.9302 3.7895 3.3575 2.6786 2.9486 4.0813 3.5470 2.6163 3.2436 5.5503 1.8451 2.4236 2.2926 3.0415 3.4446 3.9014 3.3900 3.2516 6.7270 5.8439 1.5653 2.0526 5.8835 3.5325 4.0000 10.0267 2.8506 1.3283 2.7613 4.0607 2.1386 1.5993 1.4058 2.5757 1.9702 3.7976 1.9117 2.2610 2.5738 1.3449 1.4080 2.7260 1.2465 1.3393 1.3467 2.3530 2.7410 2.3722 1.2548 1.3294 2.4039 1.9783 2.3597 2.1830 2.0220 1.4911 1.4343 1.1041 1.3206 1.4402 1.5667 1.9005 1.7290 2.0702 1.6423 1.2469 2.2193 1.2541 1.6053 1.8067 1.4071 2.5857 5.4671 2.6168 1.0826 2.0941 1.1344 1.1327 1.1368 1.1434 1.7583 2.3311 2.8909 7.3138 5.4030 6.9049 3.8218 1.0694 1.0678 1.0685 1.0817 1.0512 1.0628 1.0982 1.0968 1.0866 1.0871 1.0867 1.0934 1.0969 1.1003 1.1133 1.1146 1.0944 1.0764 1.0756
irintensity: 0.2885 0.4446 2.1397 8.9589 4.3976 0.7675 0.8471 0.8615 1.2971 5.3308 2.5119 2.6723 0.7858 3.2975 9.3838 38.4734 9.5593 6.7145 9.5644 7.9838 0.5663 0.1418 6.7137 0.2993 0.1135 68.2787 96.5401 7.2365 3.4390 6.3240 16.1816 23.0511 22.1150 1.2886 9.8318 69.1174 3.9051 59.9344 2.9439 1.5061 1.2618 23.4028 2.1077 0.9907 4.6268 1.1840 4.6935 4.6787 0.1573 6.5134 33.9000 9.7439 3.7125 3.8253 9.6437 8.4425 7.9005 1.6390 8.7437 6.7164 0.5835 2.1353 0.2849 21.8560 100.0036 216.9055 3.8630 117.9026 10.9495 63.8489 70.6889 17.5918 19.2407 45.4164 25.0027 11.2745 47.9723 97.2449 22.0808 5.1189 26.0027 9.0293 22.8941 0.3412 9.5830 58.6314 737.2818 320.3419 30.4422 23.0605 25.3547 124.0204 91.2947 63.4457 7.0193 60.1310 31.2962 35.4800 48.5279 6.1162 28.4857 0.8469 2.5571 31.8400 35.3265 29.4664 1.8770 43.5501 8.2157 17.0703 12.3416
temp: 298.150 k
press: 1.00000 atm
elementType: 8 7 7 7 6 6 6 6 6 6 6 6 6 6 6 6 6 6 6 6 1 1 1 1 1 1 1 1 1 1 1 1 1 1 1 1 1 1 1
symmnumber: 1
zpe: 842091.1 jmol-1
zpe.correction: 0.320736 hartree
zpe.thermalcorrener: 0.339482 hartree
zpe.thermalcorrenthalpy: 0.340427 hartree
zpe.thermalcorrgfe: 0.270262 hartree
zpe.sumelectzpe: -859.096256 hartree
zpe.sumelectthermal: -859.077510 hartree
zpe.sumelectthermalent: -859.076565 hartree
zpe.sumelectthermalfe: -859.146730 hartree
dipole: 2.1431 3.7970 2.5589
dipole: 5.0555
quadrupole: -96.2754 -117.0092 -123.8290
quadrupole: 0.5023 11.3966 4.7887
quadrupole: 16.0958 -4.6380 -11.4578 0.5023 11.3966 4.7887
hfenergy: -859.416992 hartree
pointgroup: C01 [X(C16H19N3O1)]
dipole: 0.7667002 -1.5238805 -1.0227464 debye
polarizability: 284.8413742|12.9774107|225.3153042|-19.2477473|21.6077701|113.817869 unknown
InChI: InChI=1S/C16H19N3O/c20-16(17-9-4-10-19-11-12-19)18-15-8-3-6-13-5-1-2-7-14(13)15/h1-3,5-8,17-18H,4,9-12H2
charge 0 multiplicity 1
39 atoms
O  0.745735 2.39981 -0.151342
N  5.534862 -1.196673 0.891014
N  1.830692 0.500433 -0.972641
N  -0.452833 0.378738 -0.469359
C  6.989311 -0.91695 0.601655
C  6.457294 -2.343034 0.562469
C  4.576819 -0.799184 -0.176467
C  4.152874 0.669327 0.01351
C  3.143047 1.162473 -1.047991
C  0.70423 1.182469 -0.501687
C  -1.763302 0.745285 -0.065872
C  -2.79066 -0.28342 -0.093199
C  -4.139309 0.076334 0.303298
C  -2.084233 2.049918 0.346851
C  -2.548058 -1.642067 -0.490444
C  -4.430545 1.417083 0.715748
C  -5.167197 -0.924448 0.277787
C  -3.416247 2.37404 0.735407
C  -3.569831 -2.595795 -0.504375
C  -4.8969 -2.234813 -0.117487
H  7.580641 -0.570981 1.454911
H  7.247142 -0.453089 -0.36172
H  6.370125 -2.815056 -0.427045
H  6.664732 -3.032338 1.386605
H  3.696838 -1.466315 -0.08147
H  4.998637 -0.936501 -1.206524
H  5.052891 1.314173 -0.036186
H  3.71915 0.79502 1.021952
H  2.9475 2.23854 -0.902982
H  3.561205 1.027692 -2.066553
H  1.766013 -0.480464 -1.246545
H  -0.34235 -0.58808 -0.774186
H  -1.297919 2.805944 0.366037
H  -1.54701 -1.97824 -0.790501
H  -5.453708 1.672715 1.013171
H  -6.180916 -0.635082 0.579778
H  -3.632931 3.400175 1.051966
H  -3.352854 -3.624898 -0.810787
H  -5.692733 -2.987142 -0.131193
