program: Gaussian 09
title: 000265386
version: EM64L-G09RevD.01
frameworkgroup: C1[X(C14H25NO4)]
method: RPBEPBE
basis: SDD
operation: Freq
keyword: #p
keyword: freq=noraman
keyword: PBEPBE/SDD
title: #p freq=noraman PBEPBE/SDD
converged: YES YES NO NO
title: Mulliken charges:
elementType: O O O O N C C C C C C C C C C C C C C H H H H H H H H H H H H H H H H H H H H H H H H H
charge: -0.253390 -0.252445 -0.239971 -0.265264 -0.137890 -0.432023 -0.392950 -0.185520 -0.575615 0.241806 0.257564 -0.296758 -0.348724 -0.302925 -0.350261 -0.347762 -0.346332 -0.687526 -0.687398 0.255037 0.235319 0.235593 0.227172 0.244723 0.279564 0.283129 0.229351 0.221415 0.203412 0.228051 0.224999 0.221754 0.225772 0.206262 0.193170 0.203367 0.201308 0.193552 0.211080 0.218714 0.215552 0.211861 0.218270 0.214955
chargesum: 0.00000
title: Mulliken charges with hydrogens summed into heavy atoms:
elementType: O O O O N C C C C C C C C C C C C C C
charge: -0.253390 -0.252445 -0.239971 -0.265264 -0.137890 0.058333 0.069816 0.059203 -0.012922 0.241806 0.257564 0.154008 0.082739 0.143828 0.081774 0.048775 0.048529 -0.042180 -0.042311
polarizability: 2.14362554e+02 -3.71062865e-02 1.61800094e+02 -4.37819391e+00 -6.79505710e+00 1.41731255e+02
1716.lowfreq: -14.6216 -5.9083 -3.3963 -0.0008 0.0002 0.0006 11.3000 14.8100 21.5810
frequency: 9.1280 13.9452 20.8914 32.2455 45.5823 47.9812 58.8060 71.4647 75.7931 89.3155 100.2011 109.8733 126.6106 138.4057 188.8625 196.8083 209.4961 225.6943 229.3952 237.6598 269.2994 292.0855 306.6436 323.4650 355.2279 398.5203 405.1530 440.1803 467.3944 547.7385 550.6616 603.9310 653.9531 690.1824 743.5217 744.5983 751.1050 788.1847 800.4571 803.7823 817.7827 825.1866 876.5375 898.8543 900.8133 920.4753 929.3529 933.6627 948.4446 952.2025 983.4045 1014.4063 1031.5028 1032.6918 1065.8713 1075.4825 1075.6677 1080.4799 1102.4957 1112.6196 1114.7641 1122.1512 1139.3633 1145.3656 1151.5899 1164.9368 1165.5683 1211.9707 1226.4798 1227.3782 1250.3065 1261.4398 1270.1075 1272.9299 1288.1108 1289.4062 1289.8782 1292.2379 1319.6686 1342.4716 1347.4776 1356.7529 1369.5646 1373.8053 1390.8597 1392.4143 1431.8228 1452.8522 1453.8457 1457.6823 1470.6729 1471.7215 1471.9708 1476.8287 1477.4048 1477.5833 1478.4353 1488.5557 1489.9232 1626.6201 1630.4307 2899.7467 2968.9040 2969.5127 2976.1132 2976.7435 2992.5355 2992.7036 3013.5420 3013.8461 3014.5948 3021.4646 3024.4640 3052.9618 3053.1141 3073.0850 3073.8676 3074.6956 3075.9374 3076.5427 3076.6117 3081.8250 3102.5764 3104.1786 3176.3536 3193.5385
redmass: 3.3818 3.7497 4.0560 4.5389 5.0253 3.2040 2.4727 1.6506 3.1167 3.6297 2.9873 2.6478 2.8531 3.6106 3.8360 3.5822 3.8451 1.6119 1.1466 1.7521 3.0733 3.2819 3.8634 3.0565 5.5520 2.7969 3.1326 4.3495 4.9538 3.2802 5.0914 4.3349 4.8432 3.8731 1.0788 1.0931 2.2724 1.7171 1.3051 2.1241 2.0457 2.5883 5.6043 1.7944 1.8048 2.9464 1.9374 1.8640 1.6979 2.1373 1.2455 2.1116 3.6633 3.7536 1.2780 2.4044 2.4113 1.3110 2.8401 2.4988 2.3936 1.7722 2.4012 1.7841 2.2397 1.7585 1.7857 1.3509 1.3199 1.3170 2.4676 1.8037 1.2903 1.2855 1.0887 1.1341 1.1524 1.0779 1.3712 1.4340 1.4289 1.6391 1.4065 1.5769 1.2170 1.2154 1.0843 1.0966 1.0983 1.0790 1.0671 1.1669 1.0762 1.0478 1.0444 1.0582 1.0593 1.0863 1.0880 9.6232 8.9423 1.0802 1.0584 1.0587 1.0365 1.0365 1.0601 1.0598 1.0646 1.0982 1.0997 1.0582 1.0577 1.1028 1.1029 1.0485 1.1010 1.1010 1.0959 1.0996 1.0996 1.0611 1.1081 1.1086 1.1181 1.1171
irintensity: 0.5268 0.0488 0.1584 0.7824 0.8462 0.6332 0.1253 0.0631 4.1771 3.1838 0.3595 1.3653 2.7798 0.4271 0.9045 0.0305 1.6818 2.0096 1.0060 1.4458 2.6315 24.2617 5.2894 8.8471 3.5084 6.6672 7.5786 11.0053 2.6499 7.7020 9.1541 16.9146 8.7350 1.0463 10.1175 12.7661 11.9348 5.8949 2.4875 0.4388 6.2952 10.4932 3.7740 18.8171 3.0706 15.2103 6.3657 82.0331 42.3675 36.9471 16.3549 38.1327 20.5007 29.1529 16.9150 5.4523 4.3206 14.3173 17.5889 125.0521 10.0401 20.3704 356.4580 23.7377 34.5881 20.6476 1.8905 19.7487 2.7384 1.3893 65.8527 162.7675 14.7430 22.8144 1.1758 1.9481 3.8789 1.7355 35.2977 0.9269 5.4623 29.4890 1.3521 12.3206 10.1683 9.3404 40.1942 8.8815 9.9597 3.8098 0.4682 4.8120 1.1924 10.1595 11.7600 6.4429 4.4149 19.0071 18.5402 270.5352 22.7635 31.7539 31.4125 32.0197 29.0433 31.7636 22.8057 20.9627 25.4304 6.9919 8.4599 43.2400 43.3013 6.2183 7.0526 19.4711 59.8837 65.0855 2.1149 96.7743 7.7440 22.0445 35.3022 30.2595 2.4734 28.0611
temp: 298.150 k
press: 1.00000 atm
elementType: 8 8 8 8 7 6 6 6 6 6 6 6 6 6 6 6 6 6 6 1 1 1 1 1 1 1 1 1 1 1 1 1 1 1 1 1 1 1 1 1 1 1 1 1
symmnumber: 1
zpe: 980668.6 jmol-1
zpe.correction: 0.373517 hartree
zpe.thermalcorrener: 0.396597 hartree
zpe.thermalcorrenthalpy: 0.397541 hartree
zpe.thermalcorrgfe: 0.315061 hartree
zpe.sumelectzpe: -902.561830 hartree
zpe.sumelectthermal: -902.538750 hartree
zpe.sumelectthermalent: -902.537806 hartree
zpe.sumelectthermalfe: -902.620286 hartree
dipole: -0.0319 -0.4669 -1.4273
dipole: 1.5020
quadrupole: -88.7071 -114.1687 -123.0263
quadrupole: -0.1638 -4.9423 -1.1477
quadrupole: 19.9269 -5.5347 -14.3922 -0.1638 -4.9423 -1.1477
hfenergy: -902.9353468 hartree
pointgroup: C01 [X(C14H25N1O4)]
dipole: -0.2386664 0.0083159 -0.5405396 debye
polarizability: 163.2870708|-11.6699122|209.9963085|-10.9039841|9.0972815|144.6105235 unknown
InChI: InChI=1S/C14H25NO4/c1-3-5-9-18-13(16)11-12(15-7-8-15)14(17)19-10-6-4-2/h12H,3-11H2,1-2H3
charge 0 multiplicity 1
44 atoms
O  1.04636 -2.76501 -0.434736
O  -0.605056 2.818478 1.350461
O  -0.154458 -2.204177 1.479259
O  -0.512884 2.064272 -0.85404
N  2.218665 -0.179784 -0.111061
C  2.622753 0.914214 -1.088303
C  2.855372 -0.546618 -1.429575
C  0.742239 -0.414752 0.002642
C  0.146445 0.576745 1.017385
C  0.490137 -1.860151 0.461094
C  -0.342393 1.861127 0.373923
C  0.854733 -4.21772 -0.123914
C  -0.471396 -4.729005 -0.700983
C  -1.159131 4.126536 0.879662
C  -2.68685 4.066304 0.752152
C  -0.643961 -6.249779 -0.47281
C  -3.280143 5.441619 0.363918
C  -1.970855 -6.78205 -1.055614
C  -4.818177 5.400521 0.234772
H  1.823887 1.438758 -1.626339
H  3.454533 1.540257 -0.750529
H  3.855608 -0.982279 -1.346279
H  2.218401 -0.997788 -2.199757
H  0.222746 -0.288175 -0.978371
H  0.897758 0.811142 1.791186
H  -0.702462 0.109178 1.551499
H  0.892214 -4.351162 0.972127
H  1.723509 -4.703175 -0.598645
H  -0.506472 -4.508748 -1.785818
H  -1.308587 -4.184939 -0.224622
H  -0.689043 4.382236 -0.087326
H  -0.842187 4.838747 1.659533
H  -2.959467 3.315841 -0.013766
H  -3.12018 3.731231 1.714505
H  0.206809 -6.792604 -0.93306
H  -0.604899 -6.466285 0.613898
H  -2.838088 5.776287 -0.596357
H  -2.992552 6.197038 1.123436
H  -2.025076 -6.605374 -2.146174
H  -2.07815 -7.868397 -0.882927
H  -2.837865 -6.277755 -0.589726
H  -5.288285 5.09387 1.18795
H  -5.225168 6.39048 -0.040603
H  -5.130582 4.677745 -0.541864
