program: Gaussian 09
title: 000265355
version: EM64L-G09RevD.01
frameworkgroup: C1[X(C9H18N2O2)]
method: RPBEPBE
basis: SDD
operation: Freq
keyword: #p
keyword: freq=noraman
keyword: PBEPBE/SDD
title: #p freq=noraman PBEPBE/SDD
converged: YES YES NO NO
title: Mulliken charges:
elementType: O O N N C C C C C C C C C H H H H H H H H H H H H H H H H H H
charge: -0.267802 -0.243913 -0.085896 -0.278194 -0.420065 -0.414092 -0.397773 -0.391606 -0.355318 -0.357313 -0.500492 0.246655 -0.506971 0.238995 0.211391 0.210225 0.238982 0.226567 0.161044 0.185368 0.239312 0.211085 0.172252 0.238262 0.237487 0.190578 0.262970 0.232043 0.233401 0.241166 0.241654
chargesum: 0.00000
title: Mulliken charges with hydrogens summed into heavy atoms:
elementType: O O N N C C C C C C C C C
charge: -0.267802 -0.243913 -0.085896 -0.039933 0.030321 0.035116 -0.010162 0.033074 0.028018 0.070752 -0.005479 0.246655 0.209249
polarizability: 1.62755242e+02 -2.25559281e+00 1.07526363e+02 1.06370894e+00 5.72622756e-02 8.76835811e+01
1716.lowfreq: -8.2852 -0.0009 -0.0002 0.0005 3.1882 10.3283 23.7882 27.6601 39.0628
frequency: 23.6429 27.3593 38.8287 54.5664 68.4174 97.3732 106.1259 117.0415 129.3383 152.5980 188.7004 194.0615 215.1490 283.4750 346.3829 350.6098 406.6275 453.1309 506.0167 573.6489 662.2172 685.1715 720.1153 775.0451 794.5251 799.4933 821.3377 836.9928 882.9432 951.5875 969.0714 987.4825 1020.8496 1037.3350 1057.9330 1062.3433 1075.9646 1082.1259 1089.6295 1107.2593 1113.5498 1124.6238 1138.8127 1143.5456 1148.5481 1164.5331 1179.4026 1213.0226 1252.5303 1259.3497 1275.4523 1277.8483 1285.0980 1308.3500 1353.0523 1372.9263 1398.4974 1423.2941 1444.7867 1451.8251 1453.0527 1454.7750 1464.3786 1464.9275 1473.2036 1481.3664 1488.8936 1498.5476 1645.6408 2840.1880 2858.5171 2872.1723 2970.9836 2996.4361 2997.4145 3004.2331 3018.3486 3034.0788 3048.1676 3058.5731 3062.0238 3065.6865 3105.2927 3149.1613 3161.2914 3178.5646 3415.4622
redmass: 3.8465 4.2198 3.5062 2.9552 2.4949 1.2045 2.1841 3.3040 2.1280 2.5444 3.1809 4.7040 3.4799 3.6546 3.4217 2.9721 3.4931 3.4702 3.0805 3.1065 2.8200 1.7876 2.5728 1.1033 1.3117 1.6669 2.4526 5.2607 1.2300 6.1323 1.3082 1.9434 2.5275 2.6167 2.0514 1.2774 1.5172 1.9069 2.5634 2.1400 1.2774 1.6953 1.6958 1.9437 1.4521 3.2979 1.5057 1.4094 1.3533 2.3760 1.3507 1.1044 1.1457 1.4356 1.4168 1.4709 1.5089 1.1971 1.0816 1.2128 1.0499 1.0863 1.0506 1.0903 1.1183 1.1188 1.0909 1.0835 9.1045 1.0714 1.0700 1.0720 1.0680 1.0844 1.0605 1.0299 1.0867 1.0883 1.0511 1.0624 1.0982 1.0979 1.1045 1.1047 1.1135 1.1147 1.0739
irintensity: 1.0037 1.9201 0.1545 1.1099 0.1783 0.4521 0.7360 1.2403 2.6276 2.2654 7.8634 3.2636 3.4109 19.8678 6.6846 2.5887 2.8115 8.9522 7.1094 2.1685 41.3077 34.3464 28.2203 4.9053 11.7943 1.0080 4.4123 17.7253 0.2120 10.2722 5.8356 40.7040 5.1677 59.8205 4.4852 4.5892 5.0681 7.0332 6.3508 107.8981 0.1455 38.2965 56.8736 72.4931 14.6882 44.7812 8.7267 7.9939 18.9607 35.7677 5.1931 0.3799 1.1492 28.9767 40.4774 53.9978 1.8106 27.3282 25.6018 18.1140 14.2315 2.3542 12.3249 2.5497 3.3602 9.5056 1.0877 5.7616 165.2256 67.6689 107.2208 128.0222 11.2307 32.6378 14.5243 31.9628 36.3849 6.3884 34.2609 34.1558 24.1277 46.6875 28.3890 17.1432 1.9090 46.4095 2.0767
temp: 298.150 k
press: 1.00000 atm
elementType: 8 8 7 7 6 6 6 6 6 6 6 6 6 1 1 1 1 1 1 1 1 1 1 1 1 1 1 1 1 1 1
symmnumber: 1
zpe: 695885.4 jmol-1
zpe.correction: 0.265049 hartree
zpe.thermalcorrener: 0.280908 hartree
zpe.thermalcorrenthalpy: 0.281853 hartree
zpe.thermalcorrgfe: 0.218666 hartree
zpe.sumelectzpe: -612.573122 hartree
zpe.sumelectthermal: -612.557262 hartree
zpe.sumelectthermalent: -612.556318 hartree
zpe.sumelectthermalfe: -612.619504 hartree
dipole: 0.1654 -1.1704 2.3260
dipole: 2.6091
quadrupole: -66.0589 -82.3859 -81.5624
quadrupole: -7.6738 -6.7908 -2.0615
quadrupole: 10.6102 -5.7168 -4.8934 -7.6738 -6.7908 -2.0615
hfenergy: -612.8381705 hartree
pointgroup: C01 [X(C9H18N2O2)]
dipole: -0.0653935 -0.1064974 -1.0188816 debye
polarizability: 162.7218886|2.2839181|105.1051807|1.637386|6.5519514|90.1381174 unknown
InChI: InChI=1S/C9H18N2O2/c1-13-9(12)3-5-10-4-2-6-11-7-8-11/h10H,2-8H2,1H3
charge 0 multiplicity 1
31 atoms
O  -4.944335 -0.819197 -0.290133
O  -4.173734 1.258773 0.424799
N  4.827677 -0.2091 0.456019
N  -0.129766 -0.315109 0.105679
C  5.4430 -0.713443 -0.82656
C  6.117645 0.397718 -0.034075
C  3.60987 0.63451 0.296939
C  2.352106 -0.252615 0.2683
C  1.056477 0.569396 0.131586
C  -1.419251 0.392324 -0.034225
C  -2.582442 -0.609776 0.082656
C  -3.937533 0.073086 0.097805
C  -6.326097 -0.279733 -0.255426
H  5.835029 -1.734632 -0.791786
H  4.965991 -0.429595 -1.776122
H  6.085573 1.408156 -0.466959
H  7.001281 0.183675 0.574959
H  3.567437 1.317113 1.167681
H  3.646717 1.268694 -0.626114
H  2.432376 -0.967998 -0.577183
H  2.307009 -0.853211 1.194279
H  0.953652 1.24745 1.002531
H  1.123926 1.224801 -0.775937
H  -0.023212 -1.053447 -0.60591
H  -1.502529 1.135152 0.779972
H  -1.511523 0.963468 -0.991566
H  -2.464436 -1.176394 1.027348
H  -2.566635 -1.356047 -0.732846
H  -6.962452 -1.117959 -0.571616
H  -6.419893 0.574928 -0.946359
H  -6.581929 0.052411 0.764863
