program: Gaussian 09
title: 000265310
version: EM64L-G09RevD.01
frameworkgroup: C1[X(C5H10ClNO2)]
method: RPBEPBE
basis: SDD
operation: Freq
keyword: #p
keyword: freq=noraman
keyword: PBEPBE/SDD
title: #p freq=noraman PBEPBE/SDD
converged: YES YES NO NO
title: Mulliken charges:
elementType: Cl O O N C C C C C H H H H H H H H H H
charge: -0.085147 -0.420391 -0.226664 -0.107843 -0.293188 -0.440382 -0.635769 -0.573084 0.235014 0.253205 0.223920 0.244803 0.228423 0.231351 0.207474 0.238747 0.278794 0.256260 0.384476
chargesum: 0.00000
title: Mulliken charges with hydrogens summed into heavy atoms:
elementType: Cl O O N C C C C C
charge: -0.085147 -0.035915 -0.226664 -0.107843 0.183937 0.032844 0.041803 -0.038030 0.235014
polarizability: 9.86264408e+01 -6.46131422e+00 7.54692626e+01 6.22007863e+00 2.04494775e-01 5.77942477e+01
1716.lowfreq: -11.5956 -1.9166 0.0029 0.0029 0.0033 5.2444 21.3121 42.0374 54.1737
frequency: 21.2370 41.9689 53.9973 93.7665 139.6772 164.4405 201.9706 249.2919 323.3647 354.8979 401.8426 436.8434 530.2363 606.2872 658.8341 688.7209 772.1522 820.8769 837.9148 946.8028 1002.0907 1042.1382 1058.2510 1077.7350 1104.5775 1118.4938 1184.7714 1245.1731 1259.4453 1270.0601 1313.9015 1321.4063 1356.1032 1369.3826 1434.5729 1449.1541 1458.2715 1468.1578 1474.2171 1481.7513 1670.5630 2886.1743 2911.1105 2946.7110 3030.4009 3064.9334 3075.0631 3084.0813 3091.6472 3157.8974 3507.9134
redmass: 12.2304 7.2529 2.6171 2.8629 3.0173 1.6729 1.8139 5.6602 4.9240 3.1829 2.7424 2.0240 3.6971 1.5003 5.0320 2.9635 1.1396 6.0235 4.4909 2.1278 1.4421 1.8885 2.7756 2.5872 1.2331 1.5783 1.5053 1.2797 1.5652 1.9048 1.5878 1.5989 1.4114 1.3210 1.1240 1.0945 1.1003 1.0881 1.0482 1.0541 8.6124 1.0546 1.0694 1.0686 1.0766 1.0629 1.0885 1.0995 1.0918 1.1117 1.0639
irintensity: 1.4495 1.1327 0.4968 3.1788 1.2441 1.4032 2.5449 1.3803 8.6282 7.9091 3.9777 3.9692 36.7825 94.1023 75.2792 94.8952 11.0565 23.2688 12.1910 18.6819 6.9680 38.2960 104.5927 113.3149 5.9090 35.0137 1.1628 8.1264 16.3738 1.4656 13.8012 34.7757 6.7314 2.6735 6.5167 6.6975 3.1881 20.4959 13.6187 11.4844 260.0900 116.6877 75.9540 55.5899 32.4634 14.8579 9.6774 18.2472 17.7473 14.6574 22.2125
temp: 298.150 k
press: 1.00000 atm
elementType: 17 8 8 7 6 6 6 6 6 1 1 1 1 1 1 1 1 1 1
symmnumber: 1
zpe: 396330.4 jmol-1
zpe.correction: 0.150954 hartree
zpe.thermalcorrener: 0.161949 hartree
zpe.thermalcorrenthalpy: 0.162893 hartree
zpe.thermalcorrgfe: 0.111606 hartree
zpe.sumelectzpe: -861.039000 hartree
zpe.sumelectthermal: -861.028005 hartree
zpe.sumelectthermalent: -861.027061 hartree
zpe.sumelectthermalfe: -861.078348 hartree
dipole: -1.0473 1.5038 0.7903
dipole: 1.9957
quadrupole: -79.5283 -52.5656 -61.0904
quadrupole: 1.0734 -5.3372 0.6380
quadrupole: -15.1335 11.8292 3.3044 1.0734 -5.3372 0.6380
hfenergy: -861.1899539 hartree
pointgroup: C01 [X(C5H10Cl1N1O2)]
dipole: 0.2680731 0.6436748 -0.3610185 debye
dipolederiv: -0.5443821 -0.2804552 -0.030561 -0.2994217 -0.4283688 -0.0297307 -0.1152699 -0.096531 -0.2277429 -0.5078156 -0.2174486 0.0011269 -0.2675527 -1.0679093 -0.1775788 0.0394771 -0.0797558 -0.3274659 -0.7861858 -0.1899869 -0.2843124 0.0015167 -0.5665206 0.0486023 -0.4584645 -0.0969531 -0.5688099 -0.7860201 -0.0510668 0.0203048 -0.1253606 -0.7001732 0.129788 -0.024277 -0.0105377 -0.5007819 0.3665199 0.1866956 0.1381614 0.2558121 0.2607457 -0.0130726 -0.073764 -0.1804725 0.2174063 0.4936994 -0.008343 -0.2031372 -0.154469 -0.0081723 0.0665029 -0.0600084 0.0559445 0.325247 0.0422143 -0.1598515 0.0121068 -0.1333697 0.5914409 -0.1265323 0.0083564 -0.0369066 0.3057065 0.6085116 0.3473751 0.0845164 0.3769232 0.4865684 0.1072646 0.227369 0.2084846 0.1633119 0.9881553 0.3049765 0.533212 0.2539437 1.3080722 0.0083729 0.6201028 0.0567616 0.5699912 0.0358737 0.0320446 0.0769038 0.0226561 -0.0165427 -0.06777 0.0724682 -0.0533208 0.0432343 -0.0865086 0.004433 -0.118453 0.030922 0.0051566 0.1108226 -0.1051391 0.071509 -0.0590617 0.0045929 -0.0668758 -0.0102592 -0.0647236 -0.0442497 0.0004084 -0.0360081 -0.0309584 0.0938128 -0.0404554 0.0321698 -0.0057091 0.0880822 0.0544623 -0.0814517 0.1457779 -0.0352967 -0.1690245 -0.11723 0.0696585 0.0924526 0.0071925 0.081956 0.0310545 0.0867948 0.0105566 0.0530762 0.0729324 0.0552207 -0.0056875 0.0414956 -0.1473346 0.0751648 -0.0402078 0.2222419 -0.1896294 0.017217 -0.1267026 -0.1019948 -0.0558225 -0.0325455 -0.0618071 -0.0893796 -0.0697404 0.0154725 0.0049841 0.020468 -0.1036225 -0.0233664 -0.0127873 0.0397256 -0.0734989 0.042175 -0.0020469 -0.0215931 -0.0034688 0.0281132 0.0293244 -0.0534294 -0.1176327 0.0345941 -0.0730468 0.0180733 0.2554902 0.0511575 -0.1231611 0.0162175 0.2896313 0.0578692 -0.1589231 0.0958464 0.2392311 unknown
polarizability: 90.507557|12.7566916|81.4986209|9.4359467|0.5784124|59.8837731 unknown
InChI: InChI=1S/C5H10ClNO2/c1-7(3-2-6)4-5(8)9/h8H,2-4H2,1H3
charge 0 multiplicity 1
19 atoms
Cl -3.289161 -1.746417 -0.305055
O  1.402805 -1.462954 0.104907
O  2.866845 0.052168 1.080723
N  -0.196468 1.01252 -0.194847
C  -1.159017 0.038573 -0.75273
C  1.214499 0.850608 -0.592859
C  -0.677857 2.405154 -0.139023
C  -1.968341 -0.577594 0.397313
C  1.931027 -0.174946 0.286244
H  -0.617777 -0.768114 -1.274536
H  -1.846949 0.515513 -1.484607
H  1.746538 1.804401 -0.447518
H  1.333717 0.551901 -1.660074
H  -1.686859 2.429535 0.308779
H  -0.739351 2.894136 -1.14112
H  -0.01735 3.011275 0.505458
H  -1.333206 -1.191348 1.050288
H  -2.522338 0.173623 0.979674
H  1.869642 -2.100537 0.711084
