program: Gaussian 09
title: 000024521
version: EM64L-G09RevD.01
frameworkgroup: C1[X(C12H14O2)]
method: RPBEPBE
basis: SDD
operation: Freq
keyword: #pfreq=noraman
keyword: PBEPBE/SDD
title: #p freq=noraman PBEPBE/SDD
converged: YES YES NO NO
title: Mulliken charges:
elementType: O O C C C C C C C C C C C C H H H H H H H H H H H H H H
charge: -0.289564 -0.266134 0.037555 -0.684245 -0.686242 0.476466 0.232762 -0.255385 -0.359778 -0.366457 -0.383233 -0.235451 -0.232834 -0.233043 0.231673 0.210642 0.253967 0.218740 0.207243 0.232205 0.222003 0.259349 0.247968 0.231296 0.236654 0.229571 0.231372 0.232901
chargesum: 0.00000
title: Mulliken charges with hydrogens summed into heavy atoms:
elementType: O O C C C C C C C C C C C C
charge: -0.289564 -0.266134 0.269228 -0.000896 -0.024791 0.476466 0.232762 0.003964 -0.111810 -0.135161 -0.146580 -0.005880 -0.001462 -0.000142
polarizability: 2.61895112e+02 -5.14738202e-01 1.29742843e+02 2.03168068e+00 5.64601178e+00 7.27835698e+01
1716.lowfreq: -10.9344 -0.0007 -0.0007 -0.0006 4.3571 5.3762 29.3839 43.9725 62.3760
frequency: 29.0147 43.9653 62.3686 73.2068 99.4595 164.7866 180.7578 189.8821 217.5473 238.3335 269.3422 280.1987 354.9812 396.7644 402.9993 443.8212 491.7196 502.6848 564.2727 615.6168 672.0006 698.4378 705.8200 771.8396 775.3593 843.6668 847.9725 889.2900 898.4187 927.9579 928.3697 941.1589 962.8924 980.2067 988.9004 997.1437 1014.2716 1026.0312 1083.5218 1098.8302 1129.4974 1156.5497 1174.1591 1183.8096 1190.9505 1217.7324 1296.4681 1300.8505 1328.7019 1335.1349 1338.7677 1380.7390 1387.5535 1396.3521 1440.5758 1456.6347 1465.4935 1472.6270 1485.6683 1487.4759 1582.2426 1598.6983 1613.2057 1647.3218 2988.8295 2992.0895 3024.7278 3083.7822 3092.2920 3097.9398 3100.1521 3104.6947 3124.1845 3129.5952 3141.8759 3152.5710 3158.8684 3167.7269
redmass: 3.5030 3.4659 4.3899 4.2420 5.3844 3.4292 2.7349 1.0259 4.5977 1.2172 4.6630 3.0783 2.9689 3.3749 2.7616 2.7608 2.9205 3.5037 6.6552 6.4261 4.8471 1.6703 6.8257 3.7015 2.0074 4.2448 1.2793 1.8182 2.7179 1.2236 1.4656 1.3906 5.2786 1.3888 6.2007 1.3116 1.2058 2.1974 1.5953 1.9919 2.6462 2.0548 1.0680 1.8767 1.1379 1.6297 1.9825 1.3992 1.6122 1.3012 1.3473 1.2580 6.9133 1.2308 2.2932 1.0524 1.0478 1.0500 2.2711 1.0575 5.7067 10.0067 6.4518 5.7179 1.0356 1.0359 1.0863 1.0994 1.0987 1.1004 1.0899 1.1007 1.0865 1.0869 1.0916 1.0963 1.0917 1.1015
irintensity: 0.3691 1.4330 0.5782 0.2179 0.7357 2.4472 1.7271 0.0237 0.3124 0.1730 9.7134 1.4388 0.5076 9.1848 0.0703 1.9709 13.6841 1.8268 17.5356 0.1774 5.8447 43.3608 4.0990 2.9973 65.2463 16.7605 0.3719 11.0774 9.2743 2.6894 0.0105 2.9326 89.3887 0.3167 4.8150 5.9240 42.1230 1.0314 17.2751 387.7228 336.8639 12.3472 3.5216 7.4070 10.3994 33.2614 99.5413 29.4447 8.3728 7.4134 18.5727 33.1582 15.4830 17.8889 16.4444 7.0480 6.0779 5.4726 14.8344 24.1272 8.7694 248.4227 26.4675 153.0922 16.4764 32.8540 7.2725 4.4949 64.2585 25.1146 2.2381 28.7370 5.2161 0.2855 11.5103 31.1809 10.3990 28.3307
temp: 298.150 k
press: 1.00000 atm
elementType: 8 8 6 6 6 6 6 6 6 6 6 6 6 6 1 1 1 1 1 1 1 1 1 1 1 1 1 1
symmnumber: 1
zpe: 598733.1 jmol-1
zpe.correction: 0.228045 hartree
zpe.thermalcorrener: 0.242112 hartree
zpe.thermalcorrenthalpy: 0.243056 hartree
zpe.thermalcorrgfe: 0.185709 hartree
zpe.sumelectzpe: -615.093306 hartree
zpe.sumelectthermal: -615.079239 hartree
zpe.sumelectthermalent: -615.078295 hartree
zpe.sumelectthermalfe: -615.135642 hartree
dipole: 1.0384 1.6773 0.3374
dipole: 2.0014
quadrupole: -61.1458 -81.8081 -86.8779
quadrupole: -3.2462 -0.1177 0.4273
quadrupole: 15.4648 -5.1975 -10.2673 -3.2462 -0.1177 0.4273
hfenergy: -615.3213513 hartree
pointgroup: C01 [X(C12H14O2)]
dipole: -0.4180595 0.6672534 -0.0008173 debye
polarizability: 261.6859364|2.1349669|130.0213876|-6.1855145|4.1328131|72.7142006 unknown
InChI: InChI=1S/C12H14O2/c1-10(2)14-12(13)9-8-11-6-4-3-5-7-11/h3-10H,1-2H3
charge 0 multiplicity 1
28 atoms
O  2.748105 0.61616 -0.008462
O  2.052464 -1.621982 -0.110954
C  4.187034 0.174201 -0.073849
C  4.568099 -0.054362 -1.544298
C  4.983508 1.287166 0.610709
C  -2.091936 -0.159113 0.038913
C  1.774905 -0.394399 -0.046241
C  -0.68835 -0.59037 -0.006332
C  0.425542 0.204021 0.008795
C  -2.486456 1.21015 0.098409
C  -3.110805 -1.155125 0.020084
C  -3.848527 1.563795 0.13683
C  -4.475423 -0.801094 0.059008
C  -4.850036 0.561054 0.117325
H  4.258751 -0.777932 0.484677
H  5.630084 -0.353207 -1.616555
H  3.953959 -0.856759 -1.985972
H  4.426245 0.872009 -2.128893
H  6.057877 1.028349 0.623733
H  4.645414 1.429101 1.651405
H  4.861425 2.242682 0.070689
H  -0.509925 -1.674866 -0.058995
H  0.383474 1.296295 0.060763
H  -1.7254 1.997937 0.11342
H  -2.821193 -2.212139 -0.025794
H  -4.1361 2.620092 0.181894
H  -5.243519 -1.581912 0.043645
H  -5.908815 0.841048 0.147247
